{"text_format":"1","workbook":"xlsx","n_sheets":5,"sheets":["Main Data Entry","Results","Historian Data","Calculations","Chart"],"not_rendered":{"charts":1,"images":0,"macros":1,"external_links":0,"defined_names":33,"comments":1,"pivot_tables":0},"unopened":[],"bounds":{"document_bytes":16777216,"sheet_cells":100000,"rows_first":2000,"rows_last":500,"rows_between":2000,"halvings":0,"cell_chars":16384,"cell_head_chars":4096},"cells_cut":0,"cells_raw":0,"read":"whole","date_system":"1900"}

{"sheet":"Main Data Entry","index":0,"n_rows":43,"n_cols":26,"rows_kept":43,"cut":false,"hidden":false,"merged":[]}
["Unit Information & Characteristics",null,null,null,null,null,null,null,null,null,null,null,null,null,null,null,null,null,null,null,null,null,null,null,null,11111109]
[]
[null,null,"Contributor Name:"]
[null,null,"Contributor Phone Number:"]
[null,null,"Contributor Email:"]
[null,null,"Generator Operator:"]
[null,null,"EIA 860 Plant Name (US Only):"]
[null,null,"EIA 860 Plant Code (US Only):"]
[null,null,"EIA 860 Generator ID (US Only):"]
[null,null,"GADS Generator Unit ID:"]
[null,null,"Planning Case Bus Number:"]
[null,null,"Interconnection:","Eastern"]
[null,null,"Balancing Authority:"]
[null,null,"Generator Type:"]
[null,null,"Generator Machine Base (MBASE)(MVA):"]
[null,null,"Inertia Constant (H):"]
[null,null,"Unit Droop Setting @ Time of Event:",null,"%"]
[null,null,"Unit Deadband Setting @ Time of Event:",null,"Hz"]
[null,null,"Unit Operating Mode @ Time of Event:",null,null,"Hz Span",{"$f":"D22*D28","v":3},"Hz"]
[null,null,"Maximum Operating Level (Pmax)(HSL) @ Time of Event:",0,"MW","Hz Span (dB)",{"$f":"G19-D23","v":2.964},"Hz"]
[null,null,"Minimum Operating Level (Pmin)(LSL) @ Time of Event:",0,"MW","Turbine NDC",{"$f":"D20","v":0},"MW"]
[null,null,"Expected Droop Setting:",0.05]
[null,null,"Expected Deadband Setting:",3.5999999999999997E-2,"Hz"]
[]
["System & Event Characteristics"]
[]
[null,null,"Time of Frequency Event (UTC):","2019-07-12T00:45:14","Date","Time"]
[null,null,"Grid Nominal Frequency:",60,{"$f":"D27","v":"2019-07-12T00:45:14"},{"$f":"D27","v":43658.031412037039}]
[]
["Report Options"]
[null,null,"Data Source:","Historian"]
[null,null,"Time Zone of Historian Data:","UTC"]
[]
["Manual Data Entry"]
[]
[null,null,null,"Pre-Perturbation Average Frequency [T(-16) to T(-2)]",null,"Hz"]
[null,null,null,"Post-Perturbation Average Frequency [T(+20 to T(+52)]",null,"Hz"]
[null,null,null,"Post-Perturbation Frequency [(T+46)]",null,"Hz"]
[null,null,null,"Pre-Perturbation Average MW [T(-2 ) to T(-16)]",null,"MW"]
[null,null,null,"Post-Perturbation Average MW [T(+20 to T(+52)]",null,"MW"]
[null,null,null,"Maximum MW Response [T(+46) to T(+60)]",null,"MW"]
[null,null,null,"MW Output [T(-4)]",null,"MW"]
[null,null,null,"MW Output [T(-60)]",null,"MW"]

{"sheet":"Results","index":1,"n_rows":18,"n_cols":5,"rows_kept":18,"cut":false,"hidden":false,"merged":[[11,0,13,4],[17,1,25,4]]}
[]
[]
[]
[]
[]
["Results"]
[]
[null,null,null,"P.U. Primary Frequency Response Performance (PUPFR):","Offline"]
[null,null,null,"P.U. Sustained Primary Frequency Response Performance (PUSPFR):","Offline"]
[null,null,null,"Overall Unit Performance:","Offline"]
[null,null,null,"Minimum Acceptable Score (PU):",0.75]
["For Generators between Pmin and % of Pmax and eligible to provide PFR;\n-Generators who provide response in the proper direction and sustained it for the lessor of the event duration or for 1 minute: J\n-Generators whose MW output remained unchanged or was in the wrong direction: L\n"]
[]
[]
[]
["Reason for Performance (optional)"]
[]
[null,"comments"]

{"sheet":"Historian Data","index":2,"n_rows":7,"n_cols":5,"rows_kept":7,"cut":false,"hidden":false,"merged":[]}
[null,null,null,"Start (2mins before T(0))",{"$f":"'Main Data Entry'!$D$27-(2/(24*60))","v":"2019-07-12T00:43:14"}]
[null,null,null,"Offset",{"$f":"myexacttimematch(E1,$A$8:$A$20000,TRUE)","v":-1}]
["-Data should be pulled for NO LESS THAN 1 minute before t(0) and NO LESS THAN 2 minutes after t(0)."]
["-Data may be pulled at any sample interval from 1s to 8s, as long as it is in the proper format."]
["-Note that the resulting Primary Frequency Response (PFR) calculations are a product of the Data provided.  Faster sampled data will provide a result most representative of the units response."]
["-Any data beyond Row 4000 of this sheet will not be sampled or used in the calculation."]
["Timestamp","Unit Frequency","MW Output"]

{"sheet":"Calculations","index":3,"n_rows":279,"n_cols":35,"rows_kept":279,"cut":false,"hidden":false,"merged":[[3,27,4,29],[3,30,4,31],[41,0,42,0],[41,2,42,3],[43,0,47,0],[43,1,47,1],[43,2,47,2],[43,3,47,3],[5,28,9,28],[5,29,9,29],[5,30,9,30],[5,31,9,31],[43,4,47,4],[43,5,47,5],[43,15,47,15],[43,16,47,16],[38,6,40,14],[5,27,9,27],[43,17,47,17],[43,6,47,6],[43,7,47,7],[43,8,47,8],[43,9,47,9],[43,10,47,10],[43,11,47,11],[41,7,42,10],[43,12,47,12],[43,13,47,13],[43,14,47,14],[41,11,42,14],[43,18,47,18]]}
["Offset (s)",{"$f":"Chart!$H$34","v":0},null,null,null,"Date (UTC):",null,null,null,null,null,null,null,null,null,{"$f":"'Main Data Entry'!D27","v":"2019-07-12T00:45:14"}]
["*Offset should not be more than +/-38s",null,null,null,null,"Time of T(0) (UTC)",null,null,null,null,null,null,null,null,null,{"$f":"'Main Data Entry'!D27","v":43658.031412037039},null,null,null,null,null,null,null,null,null,null,null,null,null,null,null,null,null,"min frequency",{"$f":"IF(MIN(AC:AC)<59.975,FLOOR(MIN(AC:AC)-0.025,0.025),59.975)","v":59.900000000000006}]
[null,null,null,null,null,null,null,null,null,null,null,null,null,null,null,null,null,null,null,null,null,null,null,null,null,null,null,null,null,null,null,null,null,"max frequency",{"$f":"IF(MAX(AC:AC)>60.025,CEILING(MAX(AC:AC)+0.025,0.025),60.025)","v":60.024999999999999}]
["Calculated using Generator provided Historian Data",null,null,null,null,null,null,null,null,null,null,null,null,null,null,null,null,null,"Calculated using Generator provided manually calculated data",null,null,null,null,null,null,null,null,"Raw Input Data",null,null,"Interpolated Values",null,null,"frequency major unit",2.5000000000000001E-2]
[null,null,null,null,null,"Pre-Perturbation Average Frequency [T(-16) to T(-2)]",null,null,null,null,null,null,null,null,null,{"$f":"$E$105","v":59.985491434733071},null,null,null,"Pre-Perturbation Average Frequency [T(-16) to T(-2)]",{"$f":"'Main Data Entry'!E36","v":0},null,null,null,null,null,null,null,null,null,null,null,null,"frequency units",{"$f":"(AI3-AI2)/AI4","v":4.9999999999997158}]
[null,null,null,null,null,"Post-Perturbation Average Frequency [T(+20 to T(+52)]",null,null,null,null,null,null,null,null,null,{"$f":"$E$141","v":59.950757460160688},null,null,null,"Post-Perturbation Average Frequency [T(+20 to T(+52)]",{"$f":"'Main Data Entry'!E37","v":0},null,null,null,null,null,null,"Timestamp","Raw Frequency (Hz)","Raw Generator Output (MW)","Raw Frequency (Hz)","Raw Generator Output (MW)",null,"min response",{"$f":"CEILING(MIN(AD:AD)-10,10)","v":440}]
[null,null,null,null,null,"Pre to Post Perturbation Delta Frequency Actual",null,null,null,null,null,null,null,null,null,{"$f":"P6-P5","v":-3.473397457238292E-2},null,null,null,"Pre to Post Perturbation Delta Frequency Actual",{"$f":"U6-U5","v":0},null,null,null,null,null,null,null,null,null,null,null,null,"max response",{"$f":"CEILING(MAX(AD:AD)+10,10)","v":470}]
[null,null,null,null,null,"Post-Perturbation Frequency (T+46)",null,null,null,null,null,null,null,null,null,{"$f":"$C$167","v":59.956798553466797},null,null,null,"Post-Perturbation Frequency (T+46)",{"$f":"'Main Data Entry'!E38","v":0},null,null,null,null,null,null,null,null,null,null,null,null,"response major unit",{"$f":"(AI7-AI6)/AI5","v":6.0000000000003411}]
[null,null,null,null,null,"Pre to Post-Event Delta Frequency Actual (T+46)",null,null,null,null,null,null,null,null,null,{"$f":"P8-P5","v":-2.8692881266273673E-2},null,null,null,"Pre to Post-Event Delta Frequency Actual (T+46)",{"$f":"U8-U5","v":0}]
[null,null,null,null,null,"High or Low Frequency Event?",null,null,null,null,null,null,null,null,null,{"$f":"IF(P6>'Main Data Entry'!D28,\"High\",IF(P6<'Main Data Entry'!D28,\"Low\",\"Does Not Compute\"))","v":"Low"},null,null,null,"High or Low Frequency Event?",{"$f":"IF(U6>'Main Data Entry'!$D$28,\"High\",IF(U6<'Main Data Entry'!$D$28,\"Low\",\"Does Not Compute\"))","v":"Low"}]
[null,null,null,null,null,null,null,null,null,null,null,null,null,null,null,null,null,null,null,null,null,null,null,null,null,null,null,{"$f":"AB12-TIME(0,0,1)","v":43658.030138888593},null,null,{"$f":"$AC$11","v":0},{"$f":"$AD$11","v":0}]
[null,null,null,null,null,"Pre-Perturbation Average MW [T(-2 ) to T(-16)]",null,null,null,null,null,null,null,null,null,{"$f":"$F$105","v":448.19947509765626},"Headroom Available:",{"$f":"'Main Data Entry'!G21-Calculations!P12","v":-448.19947509765626},null,"Pre-Perturbation Average MW [T(-2 ) to T(-16)]",{"$f":"'Main Data Entry'!E39","v":0},"Headroom Available:",{"$f":"'Main Data Entry'!$G$21-Calculations!$U$12","v":0},null,null,null,null,43658.03015046267,60.008476257324219,448.65975952148438,{"$f":"IF($AC12=\"\",$AE11,IF($AC12<>$AE11,$AC12,$AE11))","v":60.008476257324219},{"$f":"IF($AD12=\"\",$AF11,IF($AD12<>$AF11,$AD12,$AF11))","v":448.65975952148438}]
[null,null,null,null,null,"Post-Perturbation Average MW [T(+20 to T(+52)]",null,null,null,null,null,null,null,null,null,{"$f":"$F$141","v":454.29945697206438},"Footroom Available:",{"$f":"P12-'Main Data Entry'!D21","v":448.19947509765626},null,"Post-Perturbation Average MW [T(+20 to T(+52)]",{"$f":"'Main Data Entry'!E40","v":0},"Footroom Available:",{"$f":"U12-'Main Data Entry'!$D$21","v":0},null,null,null,null,43658.030162036746,null,null,60.008476257324219,448.65975952148438]
[null,null,null,null,null,"Pre to Post-Perturbation Delta MW Actual",null,null,null,null,null,null,null,null,null,{"$f":"P13-P12","v":6.0999818744081153},"Adequate Margin?",{"$f":"IF(P10=\"Low\",IF(P12>=MIN(('Main Data Entry'!G21*0.98),'Main Data Entry'!G21-5),\"No\",\"Yes\"),IF(P10=\"High\",IF(Calculations!P12<=MAX(('Main Data Entry'!D21+('Main Data Entry'!G21*0.2)),('Main Data Entry'!D21+5)),\"No\",\"Yes\")))","v":"No"},null,"Pre to Post-Perturbation Delta MW Actual",{"$f":"U13-U12","v":0},"Adequate Margin?",{"$f":"IF(U10=\"Low\",IF(U12>=MIN(('Main Data Entry'!$G$21*0.98),'Main Data Entry'!$G$21-5),\"No\",\"Yes\"),IF(U10=\"High\",IF(Calculations!U12<=MAX(('Main Data Entry'!$D$21+('Main Data Entry'!$G$21*0.2)),('Main Data Entry'!$D$21+5)),\"No\",\"Yes\")))","v":"No"},null,null,null,null,43658.030173610823,60.008274078369141,448.6790771484375,60.008274078369141,448.6790771484375]
[null,null,null,null,null,null,null,null,null,null,null,null,null,null,null,null,null,null,null,null,null,null,null,null,null,null,null,43658.0301851849,null,null,60.008274078369141,448.6790771484375]
[null,null,null,null,null,"RampMagnitude_initial",null,null,null,null,null,null,null,null,null,{"$f":"($D$117-$D$61)*0.59","v":-0.22171813964843748},null,null,null,"RampMagnitude_initial",{"$f":"('Main Data Entry'!$E$42-'Main Data Entry'!$E$43)*0.59","v":0},null,null,null,null,null,null,43658.030196758977,60.008068084716797,448.69839477539063,60.008068084716797,448.69839477539063]
[null,null,null,null,null,"Actual Primary Frequency Response (adjusted)",null,null,null,null,null,null,null,null,null,{"$f":"P14-P16","v":6.3217000140565531},null,null,null,"Actual Primary Frequency Response (adjusted)",{"$f":"U14-U16","v":0},null,null,null,null,null,null,43658.030208333053,null,null,60.008068084716797,448.69839477539063]
[null,null,null,null,null,"Expected Primary Frequency Response (Pre)",null,null,null,null,null,null,null,null,null,{"$f":"$R$105","v":0},null,null,null,"Expected Primary Frequency Response (Pre)",{"$f":"IF($U$5>'Main Data Entry'!$D$28+'Main Data Entry'!$D$23,((Calculations!$U$5-'Main Data Entry'!$D$28-'Main Data Entry'!$D$23)/('Main Data Entry'!$D$28*'Main Data Entry'!$D$22-'Main Data Entry'!$D$23))*-1*'Main Data Entry'!$D$20,IF(Calculations!$U$5<'Main Data Entry'!$D$28-'Main Data Entry'!$D$23,((Calculations!$U$5-'Main Data Entry'!$D$28+'Main Data Entry'!$D$23)/('Main Data Entry'!$D$28*'Main Data Entry'!$D$22-'Main Data Entry'!$D$23))*-1*'Main Data Entry'!$D$20,0))","v":0},null,null,null,null,null,null,43658.03021990713,60.007865905761719,448.71768188476563,60.007865905761719,448.71768188476563]
[null,null,null,null,null,"Expected Primary Frequency Response (Post)",null,null,null,null,null,null,null,null,null,{"$f":"$R$141","v":0},null,null,null,"Expected Primary Frequency Response (Post)",{"$f":"IF($U$6>'Main Data Entry'!$D$28+'Main Data Entry'!$D$23,((Calculations!$U$6-'Main Data Entry'!$D$28-'Main Data Entry'!$D$23)/('Main Data Entry'!$D$28*'Main Data Entry'!$D$22-'Main Data Entry'!$D$23))*-1*'Main Data Entry'!$D$20,IF(Calculations!$U$6<'Main Data Entry'!$D$28-'Main Data Entry'!$D$23,((Calculations!$U$6-'Main Data Entry'!$D$28+'Main Data Entry'!$D$23)/('Main Data Entry'!$D$28*'Main Data Entry'!$D$22-'Main Data Entry'!$D$23))*-1*'Main Data Entry'!$D$20,0))","v":0},null,null,null,null,null,null,43658.030231481207,null,null,60.007865905761719,448.71768188476563]
[null,null,null,null,null,"Expected Primary Frequency Response (Ideal)",null,null,null,null,null,null,null,null,null,{"$f":"$P$19-$P$18","v":0},null,null,null,"Expected Primary Frequency Response (Ideal)",{"$f":"U19-U18","v":0},null,null,null,null,null,null,43658.030243055284,60.007427215576172,448.73699951171875,60.007427215576172,448.73699951171875]
[null,null,null,null,null,"Expected Primary Frequency Response (Final)",null,null,null,null,null,null,null,null,null,{"$f":"$P$20","v":0},null,null,null,"Expected Primary Frequency Response (Final)",{"$f":"U20","v":0},null,null,null,null,null,null,43658.030254629361,null,null,60.007427215576172,448.73699951171875]
[null,null,null,null,null,null,null,null,null,null,null,null,null,null,null,null,null,null,null,null,null,null,null,null,null,null,null,43658.030266203437,60.006988525390625,448.75628662109375,60.006988525390625,448.75628662109375]
[null,null,null,null,null,"PUPFR Performance",null,null,null,null,null,null,null,null,null,{"$f":"IFERROR($P$17/$P$21,0)","v":0},"Final PUPFR Performance",{"$f":"IFERROR(IF($R$14=\"Yes\",P23,\"No Evaluation\"),0)","v":"No Evaluation"},null,"PUPFR Performance",{"$f":"IFERROR(U17/U21,0)","v":0},"Final PUPFR Performance",{"$f":"IFERROR(IF($W$14=\"Yes\",U23,\"No Evaluation\"),0)","v":"No Evaluation"},null,null,null,null,43658.030277777514,null,null,60.006988525390625,448.75628662109375]
[null,null,null,null,null,null,null,null,null,null,null,null,null,null,null,null,null,null,null,null,null,null,null,null,null,null,null,43658.030289351591,60.006549835205078,448.77560424804688,60.006549835205078,448.77560424804688]
[null,null,null,null,null,"Maximum MW Response [T(+46) to T(+60)]",null,null,null,null,null,null,null,null,null,{"$f":"MAX($D$167:$D$181)","v":454.02902221679688},null,null,null,"Maximum MW Response [T(+46) to T(+60)]",{"$f":"'Main Data Entry'!$E$41","v":0},null,null,null,null,null,null,43658.030300925668,null,null,60.006549835205078,448.77560424804688]
[null,null,null,null,null,"Actual Sustained Primary Frequency Response",null,null,null,null,null,null,null,null,null,{"$f":"P25-P12","v":5.8295471191406136},null,null,null,"Actual Sustained Primary Frequency Response",{"$f":"U25-U12","v":0},null,null,null,null,null,null,43658.030312499744,60.002735137939453,448.36380004882813,60.002735137939453,448.36380004882813]
[null,null,null,null,null,"RampMagnitude_sustained",null,null,null,null,null,null,null,null,null,{"$f":"($D$117-$D$61)*0.821","v":-0.30852642822265625},null,null,null,"RampMagnitude_sustained",{"$f":"('Main Data Entry'!$E$42-'Main Data Entry'!$E$43)*0.821","v":0},null,null,null,null,null,null,43658.030324073821,null,null,60.002735137939453,448.36380004882813]
[null,null,null,null,null,"Actual Sustained Primary Frequency Response (adjusted)",null,null,null,null,null,null,null,null,null,{"$f":"$P$26-$P$27","v":6.1380735473632697},null,null,null,"Actual Sustained Primary Frequency Response (adjusted)",{"$f":"U26-U27","v":0},null,null,null,null,null,null,43658.030335647898,59.998920440673828,448.3148193359375,59.998920440673828,448.3148193359375]
[null,null,null,null,null,"Expected Sustained Primary Frequency Response [T(+46)]",null,null,null,null,null,null,null,null,null,{"$f":"$Q$167","v":0},null,null,null,"Expected Sustained Primary Frequency Response [T(+46)]",{"$f":"V108","v":0},null,null,null,null,null,null,43658.030347221975,null,null,59.998920440673828,448.3148193359375]
[null,null,null,null,null,"Expected Sustained Primary Frequency Response (Ideal)",null,null,null,null,null,null,null,null,null,{"$f":"$P$29-$P$18","v":0},null,null,null,"Expected Sustained Primary Frequency Response (Ideal)",{"$f":"IF('Main Data Entry'!$E$38<'Main Data Entry'!$D$28-'Main Data Entry'!$D$23,(('Main Data Entry'!$E$38-'Main Data Entry'!$D$28+'Main Data Entry'!$D$23)/('Main Data Entry'!$D$28*'Main Data Entry'!$D$22-'Main Data Entry'!$D$23))*(-1)*'Main Data Entry'!$G$21,IF('Main Data Entry'!$E$38>'Main Data Entry'!$D$28+'Main Data Entry'!$D$23,(('Main Data Entry'!$E$38-'Main Data Entry'!$D$28-'Main Data Entry'!$D$23)/('Main Data Entry'!$D$28*'Main Data Entry'!$D$22-'Main Data Entry'!$D$23))*(-1)*'Main Data Entry'!$G$21,0))","v":0},null,null,null,null,null,null,43658.030358796052,59.995105743408203,448.265869140625,59.995105743408203,448.265869140625]
[null,null,null,null,null,"Expected Sustained Primary Frequency Response (Final)",null,null,null,null,null,null,null,null,null,{"$f":"$P$30","v":0},null,null,null,"Expected Sustained Primary Frequency Response (Final)",{"$f":"U30","v":0},null,null,null,null,null,null,43658.030370370128,null,null,59.995105743408203,448.265869140625]
[null,null,null,null,null,null,null,null,null,null,null,null,null,null,null,null,null,null,null,null,null,null,null,null,null,null,null,43658.030381944205,59.995105743408203,448.2169189453125,59.995105743408203,448.2169189453125]
[null,null,null,null,null,"PUSPFR Performance",null,null,null,null,null,null,null,null,null,{"$f":"IFERROR($P$28/$P$31,0)","v":0},"Final PUSPFR Performance",{"$f":"IFERROR(IF($R$14=\"Yes\",P33,\"No Evaluation\"),0)","v":"No Evaluation"},null,"PUSPFR Performance",{"$f":"IFERROR(U28/U31,0)","v":0},"Final PUSPFR Performance",{"$f":"IFERROR(IF($W$14=\"Yes\",U33,\"No Evaluation\"),0)","v":"No Evaluation"},null,null,null,null,43658.030393518282,null,null,59.995105743408203,448.2169189453125]
[null,null,null,null,null,null,null,null,null,null,null,null,null,null,null,null,null,null,null,null,null,null,null,null,null,null,null,43658.030405092359,59.995105743408203,448.16793823242188,59.995105743408203,448.16793823242188]
[null,null,null,null,null,null,null,null,null,null,null,null,null,null,null,null,null,null,null,null,null,null,null,null,null,null,null,43658.030416666435,null,null,59.995105743408203,448.16793823242188]
[null,null,null,null,null,null,null,null,null,null,null,null,null,null,null,null,null,null,null,null,null,null,null,null,null,null,null,43658.030428240512,59.981327056884766,447.92868041992188,59.981327056884766,447.92868041992188]
[null,null,null,null,null,null,null,null,null,null,null,null,null,null,null,null,null,null,null,null,null,null,null,null,null,null,null,43658.030439814589,null,null,59.981327056884766,447.92868041992188]
[null,null,null,null,null,null,null,null,null,null,null,null,null,null,null,null,null,null,null,null,null,null,null,null,null,null,null,{"$f":"AB39-TIME(0,0,1)","v":43658.030451388666},59.977340698242188,448.16000366210938,59.977340698242188,448.16000366210938]
[null,"Pre-Event Period",null,null,null,null,"Chart Values",null,null,null,null,null,null,null,null,null,null,null,null,null,null,null,null,null,null,null,null,43658.030462962743,null,null,59.977340698242188,448.16000366210938]
[null,"T(0)",null,null,null,null,null,null,null,null,null,null,null,null,null,null,null,null,null,null,null,null,null,null,null,null,null,43658.030474536819,59.973384857177734,448.66165161132813,59.973384857177734,448.66165161132813]
[null,"Post-Event Period",null,null,null,null,null,null,null,null,null,null,null,null,null,null,null,null,null,null,null,null,null,null,null,null,null,43658.030486110896,null,null,59.973384857177734,448.66165161132813]
[null,"Input Data","Interpolated",null,"*Note that all times are in UTC time",null,null,"Pre and Post-Perturbation Average Values",null,null,null,"PFR Values",null,null,null,null,null,null,null,null,null,null,null,null,null,null,null,43658.030497684973,59.973369598388672,448.66342163085938,59.973369598388672,448.66342163085938]
[null,null,null,null,"*Note that the first few rows in this might be blank depending on data provided.",null,null,null,null,null,null,null,null,null,null,null,null,null,null,null,null,null,null,null,null,null,null,43658.03050925905,null,null,59.973369598388672,448.66342163085938]
["T","Offset Timestamp","Offset Frequency (Hz)","Offset Generator Output (MW)","Average Frequency (Hz)","Average Output (MW)","Proxy","Pre-Perturbation Frequency (Hz)","Post-Perturbation Frequency (Hz)","Pre-Perturbation Output (MW)","Post-Perturbation Output (MW)","Measured Initial Response (MW)","Expected Initial PFR (MW)","Measured Sustained Response (MW)","Expected Sustained PFR (MW)","HSL (MW)","Ideal Expected Primary Frequency Response (EPFR) (MW)","Average EPFR (MW)","36 mHz Deadband",null,null,null,null,null,null,null,null,43658.030520833127,59.973369598388672,448.66342163085938,59.973369598388672,448.66342163085938]
[null,null,null,null,null,null,null,null,null,null,null,null,null,null,null,null,null,null,null,null,null,null,null,null,null,null,null,43658.030532407203,null,null,59.973369598388672,448.66342163085938]
[null,null,null,null,null,null,null,null,null,null,null,null,null,null,null,null,null,null,null,null,null,null,null,null,null,null,null,43658.03054398128,59.973369598388672,448.66314697265625,59.973369598388672,448.66314697265625]
[null,null,null,null,null,null,null,null,null,null,null,null,null,null,null,null,null,null,null,null,null,null,null,null,null,null,null,43658.030555555357,null,null,59.973369598388672,448.66314697265625]
[null,null,null,null,null,null,null,null,null,null,null,null,null,null,null,null,null,null,null,null,null,null,null,null,null,null,null,{"$f":"AB49-TIME(0,0,1)","v":43658.030567129434},59.971733093261719,448.12603759765625,59.971733093261719,448.12603759765625]
["T-72s",{"$f":"B50-TIME(0,0,1)","v":43658.03057870351},{"$f":"OFFSET($AE49,-$B$1,0)","v":59.971733093261719},{"$f":"OFFSET($AF49,-$B$1,0)","v":448.12603759765625},null,null,null,null,null,null,null,null,null,null,null,{"$f":"'Main Data Entry'!$G$21","v":0},{"$f":"IF($C49>(60+'Main Data Entry'!$D$23),(($C49-60-'Main Data Entry'!$D$23)/(60*'Main Data Entry'!$D$22-'Main Data Entry'!$D$23))*(-1)*'Main Data Entry'!$G$21,IF($C49<(60-'Main Data Entry'!$D$23),(($C49-60+'Main Data Entry'!$D$23)/(60*'Main Data Entry'!$D$22-'Main Data Entry'!$D$23))*(-1)*'Main Data Entry'!$G$21,0))","v":0},null,{"$f":"Grid_Nominal_Frequency-Expected_Deadband_Setting","v":59.963999999999999},null,null,null,null,null,null,null,null,{"$f":"AB50-TIME(0,0,1)","v":43658.03057870351},null,null,59.971733093261719,448.12603759765625]
["T-71s",{"$f":"B51-TIME(0,0,1)","v":43658.030590277587},59.971729278564453,448.12469482421875,null,null,null,null,null,null,null,null,null,null,null,{"$f":"'Main Data Entry'!$G$21","v":0},{"$f":"IF($C50>(60+'Main Data Entry'!$D$23),(($C50-60-'Main Data Entry'!$D$23)/(60*'Main Data Entry'!$D$22-'Main Data Entry'!$D$23))*(-1)*'Main Data Entry'!$G$21,IF($C50<(60-'Main Data Entry'!$D$23),(($C50-60+'Main Data Entry'!$D$23)/(60*'Main Data Entry'!$D$22-'Main Data Entry'!$D$23))*(-1)*'Main Data Entry'!$G$21,0))","v":0},null,59.963999999999999,null,null,null,null,null,null,null,null,43658.030590277587,59.971729278564453,448.12469482421875,59.971729278564453,448.12469482421875]
["T-70s",43658.030601851664,59.971729278564453,448.12469482421875,null,null,null,null,null,null,null,null,null,null,null,{"$f":"'Main Data Entry'!$G$21","v":0},{"$f":"IF($C51>(60+'Main Data Entry'!$D$23),(($C51-60-'Main Data Entry'!$D$23)/(60*'Main Data Entry'!$D$22-'Main Data Entry'!$D$23))*(-1)*'Main Data Entry'!$G$21,IF($C51<(60-'Main Data Entry'!$D$23),(($C51-60+'Main Data Entry'!$D$23)/(60*'Main Data Entry'!$D$22-'Main Data Entry'!$D$23))*(-1)*'Main Data Entry'!$G$21,0))","v":0},null,59.963999999999999,null,null,null,null,null,null,null,null,43658.030601851664,null,null,59.971729278564453,448.12469482421875]
["T-69s",43658.030613425741,59.971729278564453,448.12469482421875,null,null,null,null,null,null,null,null,null,null,null,{"$f":"'Main Data Entry'!$G$21","v":0},{"$f":"IF($C52>(60+'Main Data Entry'!$D$23),(($C52-60-'Main Data Entry'!$D$23)/(60*'Main Data Entry'!$D$22-'Main Data Entry'!$D$23))*(-1)*'Main Data Entry'!$G$21,IF($C52<(60-'Main Data Entry'!$D$23),(($C52-60+'Main Data Entry'!$D$23)/(60*'Main Data Entry'!$D$22-'Main Data Entry'!$D$23))*(-1)*'Main Data Entry'!$G$21,0))","v":0},null,59.963999999999999,null,null,null,null,null,null,null,null,43658.030613425741,59.971729278564453,448.12469482421875,59.971729278564453,448.12469482421875]
["T-68s",43658.030624999818,59.971729278564453,448.12469482421875,null,null,null,null,null,null,null,null,null,null,null,{"$f":"'Main Data Entry'!$G$21","v":0},{"$f":"IF($C53>(60+'Main Data Entry'!$D$23),(($C53-60-'Main Data Entry'!$D$23)/(60*'Main Data Entry'!$D$22-'Main Data Entry'!$D$23))*(-1)*'Main Data Entry'!$G$21,IF($C53<(60-'Main Data Entry'!$D$23),(($C53-60+'Main Data Entry'!$D$23)/(60*'Main Data Entry'!$D$22-'Main Data Entry'!$D$23))*(-1)*'Main Data Entry'!$G$21,0))","v":0},null,59.963999999999999,null,null,null,null,null,null,null,null,43658.030624999818,null,null,59.971729278564453,448.12469482421875]
["T-67s",43658.030636573894,59.971729278564453,448.12469482421875,null,null,null,null,null,null,null,null,null,null,null,{"$f":"'Main Data Entry'!$G$21","v":0},{"$f":"IF($C54>(60+'Main Data Entry'!$D$23),(($C54-60-'Main Data Entry'!$D$23)/(60*'Main Data Entry'!$D$22-'Main Data Entry'!$D$23))*(-1)*'Main Data Entry'!$G$21,IF($C54<(60-'Main Data Entry'!$D$23),(($C54-60+'Main Data Entry'!$D$23)/(60*'Main Data Entry'!$D$22-'Main Data Entry'!$D$23))*(-1)*'Main Data Entry'!$G$21,0))","v":0},null,59.963999999999999,null,null,null,null,null,null,null,null,43658.030636573894,59.971729278564453,448.12469482421875,59.971729278564453,448.12469482421875]
["T-66s",43658.030648147971,59.971729278564453,448.12469482421875,null,null,null,null,null,null,null,null,null,null,null,{"$f":"'Main Data Entry'!$G$21","v":0},{"$f":"IF($C55>(60+'Main Data Entry'!$D$23),(($C55-60-'Main Data Entry'!$D$23)/(60*'Main Data Entry'!$D$22-'Main Data Entry'!$D$23))*(-1)*'Main Data Entry'!$G$21,IF($C55<(60-'Main Data Entry'!$D$23),(($C55-60+'Main Data Entry'!$D$23)/(60*'Main Data Entry'!$D$22-'Main Data Entry'!$D$23))*(-1)*'Main Data Entry'!$G$21,0))","v":0},null,59.963999999999999,null,null,null,null,null,null,null,null,43658.030648147971,null,null,59.971729278564453,448.12469482421875]
["T-65s",43658.030659722048,59.969863891601563,448.45703125,null,null,null,null,null,null,null,null,null,null,null,{"$f":"'Main Data Entry'!$G$21","v":0},{"$f":"IF($C56>(60+'Main Data Entry'!$D$23),(($C56-60-'Main Data Entry'!$D$23)/(60*'Main Data Entry'!$D$22-'Main Data Entry'!$D$23))*(-1)*'Main Data Entry'!$G$21,IF($C56<(60-'Main Data Entry'!$D$23),(($C56-60+'Main Data Entry'!$D$23)/(60*'Main Data Entry'!$D$22-'Main Data Entry'!$D$23))*(-1)*'Main Data Entry'!$G$21,0))","v":0},null,59.963999999999999,null,null,null,null,null,null,null,null,43658.030659722048,59.969863891601563,448.45703125,59.969863891601563,448.45703125]
["T-64s",43658.030671296125,59.969863891601563,448.45703125,null,null,null,null,null,null,null,null,null,null,null,{"$f":"'Main Data Entry'!$G$21","v":0},{"$f":"IF($C57>(60+'Main Data Entry'!$D$23),(($C57-60-'Main Data Entry'!$D$23)/(60*'Main Data Entry'!$D$22-'Main Data Entry'!$D$23))*(-1)*'Main Data Entry'!$G$21,IF($C57<(60-'Main Data Entry'!$D$23),(($C57-60+'Main Data Entry'!$D$23)/(60*'Main Data Entry'!$D$22-'Main Data Entry'!$D$23))*(-1)*'Main Data Entry'!$G$21,0))","v":0},null,59.963999999999999,null,null,null,null,null,null,null,null,43658.030671296125,null,null,59.969863891601563,448.45703125]
["T-63s",43658.030682870201,59.970897674560547,447.998779296875,null,null,null,null,null,null,null,null,null,null,null,{"$f":"'Main Data Entry'!$G$21","v":0},{"$f":"IF($C58>(60+'Main Data Entry'!$D$23),(($C58-60-'Main Data Entry'!$D$23)/(60*'Main Data Entry'!$D$22-'Main Data Entry'!$D$23))*(-1)*'Main Data Entry'!$G$21,IF($C58<(60-'Main Data Entry'!$D$23),(($C58-60+'Main Data Entry'!$D$23)/(60*'Main Data Entry'!$D$22-'Main Data Entry'!$D$23))*(-1)*'Main Data Entry'!$G$21,0))","v":0},null,59.963999999999999,null,null,null,null,null,null,null,null,43658.030682870201,59.970897674560547,447.998779296875,59.970897674560547,447.998779296875]
["T-62s",43658.030694444278,59.970897674560547,447.998779296875,null,null,null,null,null,null,null,null,null,null,null,{"$f":"'Main Data Entry'!$G$21","v":0},{"$f":"IF($C59>(60+'Main Data Entry'!$D$23),(($C59-60-'Main Data Entry'!$D$23)/(60*'Main Data Entry'!$D$22-'Main Data Entry'!$D$23))*(-1)*'Main Data Entry'!$G$21,IF($C59<(60-'Main Data Entry'!$D$23),(($C59-60+'Main Data Entry'!$D$23)/(60*'Main Data Entry'!$D$22-'Main Data Entry'!$D$23))*(-1)*'Main Data Entry'!$G$21,0))","v":0},null,59.963999999999999,null,null,null,null,null,null,null,null,43658.030694444278,null,null,59.970897674560547,447.998779296875]
["T-61s",43658.030706018355,59.97052001953125,448.68463134765625,null,null,null,null,null,null,null,null,null,null,null,{"$f":"'Main Data Entry'!$G$21","v":0},{"$f":"IF($C60>(60+'Main Data Entry'!$D$23),(($C60-60-'Main Data Entry'!$D$23)/(60*'Main Data Entry'!$D$22-'Main Data Entry'!$D$23))*(-1)*'Main Data Entry'!$G$21,IF($C60<(60-'Main Data Entry'!$D$23),(($C60-60+'Main Data Entry'!$D$23)/(60*'Main Data Entry'!$D$22-'Main Data Entry'!$D$23))*(-1)*'Main Data Entry'!$G$21,0))","v":0},null,59.963999999999999,null,null,null,null,null,null,null,null,43658.030706018355,59.97052001953125,448.68463134765625,59.97052001953125,448.68463134765625]
["T-60s",43658.030717592432,59.97052001953125,448.68463134765625,null,null,null,null,null,null,null,null,null,null,null,{"$f":"'Main Data Entry'!$G$21","v":0},{"$f":"IF($C61>(60+'Main Data Entry'!$D$23),(($C61-60-'Main Data Entry'!$D$23)/(60*'Main Data Entry'!$D$22-'Main Data Entry'!$D$23))*(-1)*'Main Data Entry'!$G$21,IF($C61<(60-'Main Data Entry'!$D$23),(($C61-60+'Main Data Entry'!$D$23)/(60*'Main Data Entry'!$D$22-'Main Data Entry'!$D$23))*(-1)*'Main Data Entry'!$G$21,0))","v":0},null,59.963999999999999,null,null,null,null,null,null,null,null,43658.030717592432,null,null,59.97052001953125,448.68463134765625]
["T-59s",43658.030729166509,59.970134735107422,448.68670654296875,null,null,null,null,null,null,null,null,null,null,null,{"$f":"'Main Data Entry'!$G$21","v":0},{"$f":"IF($C62>(60+'Main Data Entry'!$D$23),(($C62-60-'Main Data Entry'!$D$23)/(60*'Main Data Entry'!$D$22-'Main Data Entry'!$D$23))*(-1)*'Main Data Entry'!$G$21,IF($C62<(60-'Main Data Entry'!$D$23),(($C62-60+'Main Data Entry'!$D$23)/(60*'Main Data Entry'!$D$22-'Main Data Entry'!$D$23))*(-1)*'Main Data Entry'!$G$21,0))","v":0},null,59.963999999999999,null,null,null,null,null,null,null,null,43658.030729166509,59.970134735107422,448.68670654296875,59.970134735107422,448.68670654296875]
["T-58s",43658.030740740585,59.970134735107422,448.68670654296875,null,null,null,null,null,null,null,null,null,null,null,{"$f":"'Main Data Entry'!$G$21","v":0},{"$f":"IF($C63>(60+'Main Data Entry'!$D$23),(($C63-60-'Main Data Entry'!$D$23)/(60*'Main Data Entry'!$D$22-'Main Data Entry'!$D$23))*(-1)*'Main Data Entry'!$G$21,IF($C63<(60-'Main Data Entry'!$D$23),(($C63-60+'Main Data Entry'!$D$23)/(60*'Main Data Entry'!$D$22-'Main Data Entry'!$D$23))*(-1)*'Main Data Entry'!$G$21,0))","v":0},null,59.963999999999999,null,null,null,null,null,null,null,null,43658.030740740585,null,null,59.970134735107422,448.68670654296875]
["T-57s",43658.030752314662,59.969753265380859,448.68670654296875,null,null,null,null,null,null,null,null,null,null,null,{"$f":"'Main Data Entry'!$G$21","v":0},{"$f":"IF($C64>(60+'Main Data Entry'!$D$23),(($C64-60-'Main Data Entry'!$D$23)/(60*'Main Data Entry'!$D$22-'Main Data Entry'!$D$23))*(-1)*'Main Data Entry'!$G$21,IF($C64<(60-'Main Data Entry'!$D$23),(($C64-60+'Main Data Entry'!$D$23)/(60*'Main Data Entry'!$D$22-'Main Data Entry'!$D$23))*(-1)*'Main Data Entry'!$G$21,0))","v":0},null,59.963999999999999,null,null,null,null,null,null,null,null,43658.030752314662,59.969753265380859,448.68670654296875,59.969753265380859,448.68670654296875]
["T-56s",43658.030763888739,59.969753265380859,448.68670654296875,null,null,null,null,null,null,null,null,null,null,null,{"$f":"'Main Data Entry'!$G$21","v":0},{"$f":"IF($C65>(60+'Main Data Entry'!$D$23),(($C65-60-'Main Data Entry'!$D$23)/(60*'Main Data Entry'!$D$22-'Main Data Entry'!$D$23))*(-1)*'Main Data Entry'!$G$21,IF($C65<(60-'Main Data Entry'!$D$23),(($C65-60+'Main Data Entry'!$D$23)/(60*'Main Data Entry'!$D$22-'Main Data Entry'!$D$23))*(-1)*'Main Data Entry'!$G$21,0))","v":0},null,59.963999999999999,null,null,null,null,null,null,null,null,{"$f":"AB66-TIME(0,0,1)","v":43658.030763888739},null,null,59.969753265380859,448.68670654296875]
["T-55s",43658.030775462816,59.971080780029297,448.368896484375,null,null,null,null,null,null,null,null,null,null,null,{"$f":"'Main Data Entry'!$G$21","v":0},{"$f":"IF($C66>(60+'Main Data Entry'!$D$23),(($C66-60-'Main Data Entry'!$D$23)/(60*'Main Data Entry'!$D$22-'Main Data Entry'!$D$23))*(-1)*'Main Data Entry'!$G$21,IF($C66<(60-'Main Data Entry'!$D$23),(($C66-60+'Main Data Entry'!$D$23)/(60*'Main Data Entry'!$D$22-'Main Data Entry'!$D$23))*(-1)*'Main Data Entry'!$G$21,0))","v":0},null,59.963999999999999,null,null,null,null,null,null,null,null,43658.030775462816,59.971080780029297,448.368896484375,59.971080780029297,448.368896484375]
["T-54s",43658.030787036892,59.971080780029297,448.368896484375,null,null,null,null,null,null,null,null,null,null,null,{"$f":"'Main Data Entry'!$G$21","v":0},{"$f":"IF($C67>(60+'Main Data Entry'!$D$23),(($C67-60-'Main Data Entry'!$D$23)/(60*'Main Data Entry'!$D$22-'Main Data Entry'!$D$23))*(-1)*'Main Data Entry'!$G$21,IF($C67<(60-'Main Data Entry'!$D$23),(($C67-60+'Main Data Entry'!$D$23)/(60*'Main Data Entry'!$D$22-'Main Data Entry'!$D$23))*(-1)*'Main Data Entry'!$G$21,0))","v":0},null,59.963999999999999,null,null,null,null,null,null,null,null,43658.030787036892,null,null,59.971080780029297,448.368896484375]
["T-53s",43658.030798610969,59.970981597900391,448.55780029296875,null,null,null,null,null,null,null,null,null,null,null,{"$f":"'Main Data Entry'!$G$21","v":0},{"$f":"IF($C68>(60+'Main Data Entry'!$D$23),(($C68-60-'Main Data Entry'!$D$23)/(60*'Main Data Entry'!$D$22-'Main Data Entry'!$D$23))*(-1)*'Main Data Entry'!$G$21,IF($C68<(60-'Main Data Entry'!$D$23),(($C68-60+'Main Data Entry'!$D$23)/(60*'Main Data Entry'!$D$22-'Main Data Entry'!$D$23))*(-1)*'Main Data Entry'!$G$21,0))","v":0},null,59.963999999999999,null,null,null,null,null,null,null,null,43658.030798610969,59.970981597900391,448.55780029296875,59.970981597900391,448.55780029296875]
["T-52s",43658.030810185046,59.970981597900391,448.55780029296875,null,null,null,null,null,null,null,null,null,null,null,{"$f":"'Main Data Entry'!$G$21","v":0},{"$f":"IF($C69>(60+'Main Data Entry'!$D$23),(($C69-60-'Main Data Entry'!$D$23)/(60*'Main Data Entry'!$D$22-'Main Data Entry'!$D$23))*(-1)*'Main Data Entry'!$G$21,IF($C69<(60-'Main Data Entry'!$D$23),(($C69-60+'Main Data Entry'!$D$23)/(60*'Main Data Entry'!$D$22-'Main Data Entry'!$D$23))*(-1)*'Main Data Entry'!$G$21,0))","v":0},null,59.963999999999999,null,null,null,null,null,null,null,null,43658.030810185046,null,null,59.970981597900391,448.55780029296875]
["T-51s",43658.030821759123,59.970882415771484,448.55780029296875,null,null,null,null,null,null,null,null,null,null,null,{"$f":"'Main Data Entry'!$G$21","v":0},{"$f":"IF($C70>(60+'Main Data Entry'!$D$23),(($C70-60-'Main Data Entry'!$D$23)/(60*'Main Data Entry'!$D$22-'Main Data Entry'!$D$23))*(-1)*'Main Data Entry'!$G$21,IF($C70<(60-'Main Data Entry'!$D$23),(($C70-60+'Main Data Entry'!$D$23)/(60*'Main Data Entry'!$D$22-'Main Data Entry'!$D$23))*(-1)*'Main Data Entry'!$G$21,0))","v":0},null,59.963999999999999,null,null,null,null,null,null,null,null,43658.030821759123,59.970882415771484,448.55780029296875,59.970882415771484,448.55780029296875]
["T-50s",43658.0308333332,59.970882415771484,448.55780029296875,null,null,null,null,null,null,null,null,null,null,null,{"$f":"'Main Data Entry'!$G$21","v":0},{"$f":"IF($C71>(60+'Main Data Entry'!$D$23),(($C71-60-'Main Data Entry'!$D$23)/(60*'Main Data Entry'!$D$22-'Main Data Entry'!$D$23))*(-1)*'Main Data Entry'!$G$21,IF($C71<(60-'Main Data Entry'!$D$23),(($C71-60+'Main Data Entry'!$D$23)/(60*'Main Data Entry'!$D$22-'Main Data Entry'!$D$23))*(-1)*'Main Data Entry'!$G$21,0))","v":0},null,59.963999999999999,null,null,null,null,null,null,null,null,43658.0308333332,null,null,59.970882415771484,448.55780029296875]
["T-49s",43658.030844907276,59.970783233642578,448.55780029296875,null,null,null,null,null,null,null,null,null,null,null,{"$f":"'Main Data Entry'!$G$21","v":0},{"$f":"IF($C72>(60+'Main Data Entry'!$D$23),(($C72-60-'Main Data Entry'!$D$23)/(60*'Main Data Entry'!$D$22-'Main Data Entry'!$D$23))*(-1)*'Main Data Entry'!$G$21,IF($C72<(60-'Main Data Entry'!$D$23),(($C72-60+'Main Data Entry'!$D$23)/(60*'Main Data Entry'!$D$22-'Main Data Entry'!$D$23))*(-1)*'Main Data Entry'!$G$21,0))","v":0},null,59.963999999999999,null,null,null,null,null,null,null,null,43658.030844907276,59.970783233642578,448.55780029296875,59.970783233642578,448.55780029296875]
["T-48s",43658.030856481353,59.970783233642578,448.55780029296875,null,null,null,null,null,null,null,null,null,null,null,{"$f":"'Main Data Entry'!$G$21","v":0},{"$f":"IF($C73>(60+'Main Data Entry'!$D$23),(($C73-60-'Main Data Entry'!$D$23)/(60*'Main Data Entry'!$D$22-'Main Data Entry'!$D$23))*(-1)*'Main Data Entry'!$G$21,IF($C73<(60-'Main Data Entry'!$D$23),(($C73-60+'Main Data Entry'!$D$23)/(60*'Main Data Entry'!$D$22-'Main Data Entry'!$D$23))*(-1)*'Main Data Entry'!$G$21,0))","v":0},null,59.963999999999999,null,null,null,null,null,null,null,null,43658.030856481353,null,null,59.970783233642578,448.55780029296875]
["T-47s",43658.03086805543,59.970684051513672,448.55780029296875,null,null,null,null,null,null,null,null,null,null,null,{"$f":"'Main Data Entry'!$G$21","v":0},{"$f":"IF($C74>(60+'Main Data Entry'!$D$23),(($C74-60-'Main Data Entry'!$D$23)/(60*'Main Data Entry'!$D$22-'Main Data Entry'!$D$23))*(-1)*'Main Data Entry'!$G$21,IF($C74<(60-'Main Data Entry'!$D$23),(($C74-60+'Main Data Entry'!$D$23)/(60*'Main Data Entry'!$D$22-'Main Data Entry'!$D$23))*(-1)*'Main Data Entry'!$G$21,0))","v":0},null,59.963999999999999,null,null,null,null,null,null,null,null,43658.03086805543,59.970684051513672,448.55780029296875,59.970684051513672,448.55780029296875]
["T-46s",43658.030879629507,59.970684051513672,448.55780029296875,null,null,null,null,null,null,null,null,null,null,null,{"$f":"'Main Data Entry'!$G$21","v":0},{"$f":"IF($C75>(60+'Main Data Entry'!$D$23),(($C75-60-'Main Data Entry'!$D$23)/(60*'Main Data Entry'!$D$22-'Main Data Entry'!$D$23))*(-1)*'Main Data Entry'!$G$21,IF($C75<(60-'Main Data Entry'!$D$23),(($C75-60+'Main Data Entry'!$D$23)/(60*'Main Data Entry'!$D$22-'Main Data Entry'!$D$23))*(-1)*'Main Data Entry'!$G$21,0))","v":0},null,59.963999999999999,null,null,null,null,null,null,null,null,43658.030879629507,null,null,59.970684051513672,448.55780029296875]
["T-45s",43658.030891203583,59.972606658935547,448.28182983398438,null,null,null,null,null,null,null,null,null,null,null,{"$f":"'Main Data Entry'!$G$21","v":0},{"$f":"IF($C76>(60+'Main Data Entry'!$D$23),(($C76-60-'Main Data Entry'!$D$23)/(60*'Main Data Entry'!$D$22-'Main Data Entry'!$D$23))*(-1)*'Main Data Entry'!$G$21,IF($C76<(60-'Main Data Entry'!$D$23),(($C76-60+'Main Data Entry'!$D$23)/(60*'Main Data Entry'!$D$22-'Main Data Entry'!$D$23))*(-1)*'Main Data Entry'!$G$21,0))","v":0},null,59.963999999999999,null,null,null,null,null,null,null,null,43658.030891203583,59.972606658935547,448.28182983398438,{"$f":"IF($AC76=\"\",$AE75,IF($AC76<>$AE75,$AC76,$AE75))","v":59.972606658935547},{"$f":"IF($AD76=\"\",$AF75,IF($AD76<>$AF75,$AD76,$AF75))","v":448.28182983398438}]
["T-44s",43658.03090277766,59.972606658935547,448.28182983398438,null,null,null,null,null,null,null,null,null,null,null,{"$f":"'Main Data Entry'!$G$21","v":0},{"$f":"IF($C77>(60+'Main Data Entry'!$D$23),(($C77-60-'Main Data Entry'!$D$23)/(60*'Main Data Entry'!$D$22-'Main Data Entry'!$D$23))*(-1)*'Main Data Entry'!$G$21,IF($C77<(60-'Main Data Entry'!$D$23),(($C77-60+'Main Data Entry'!$D$23)/(60*'Main Data Entry'!$D$22-'Main Data Entry'!$D$23))*(-1)*'Main Data Entry'!$G$21,0))","v":0},null,59.963999999999999,null,null,null,null,null,null,null,null,43658.03090277766,null,null,59.972606658935547,448.28182983398438]
["T-43s",43658.030914351737,59.974533081054688,448.52008056640625,null,null,null,null,null,null,null,null,null,null,null,{"$f":"'Main Data Entry'!$G$21","v":0},{"$f":"IF($C78>(60+'Main Data Entry'!$D$23),(($C78-60-'Main Data Entry'!$D$23)/(60*'Main Data Entry'!$D$22-'Main Data Entry'!$D$23))*(-1)*'Main Data Entry'!$G$21,IF($C78<(60-'Main Data Entry'!$D$23),(($C78-60+'Main Data Entry'!$D$23)/(60*'Main Data Entry'!$D$22-'Main Data Entry'!$D$23))*(-1)*'Main Data Entry'!$G$21,0))","v":0},null,59.963999999999999,null,null,null,null,null,null,null,null,43658.030914351737,59.974533081054688,448.52008056640625,59.974533081054688,448.52008056640625]
["T-42s",43658.030925925814,59.974533081054688,448.52008056640625,null,null,null,null,null,null,null,null,null,null,null,{"$f":"'Main Data Entry'!$G$21","v":0},{"$f":"IF($C79>(60+'Main Data Entry'!$D$23),(($C79-60-'Main Data Entry'!$D$23)/(60*'Main Data Entry'!$D$22-'Main Data Entry'!$D$23))*(-1)*'Main Data Entry'!$G$21,IF($C79<(60-'Main Data Entry'!$D$23),(($C79-60+'Main Data Entry'!$D$23)/(60*'Main Data Entry'!$D$22-'Main Data Entry'!$D$23))*(-1)*'Main Data Entry'!$G$21,0))","v":0},null,59.963999999999999,null,null,null,null,null,null,null,null,43658.030925925814,null,null,59.974533081054688,448.52008056640625]
["T-41s",43658.030937499891,59.974540710449219,448.13424682617188,null,null,null,null,null,null,null,null,null,null,null,{"$f":"'Main Data Entry'!$G$21","v":0},{"$f":"IF($C80>(60+'Main Data Entry'!$D$23),(($C80-60-'Main Data Entry'!$D$23)/(60*'Main Data Entry'!$D$22-'Main Data Entry'!$D$23))*(-1)*'Main Data Entry'!$G$21,IF($C80<(60-'Main Data Entry'!$D$23),(($C80-60+'Main Data Entry'!$D$23)/(60*'Main Data Entry'!$D$22-'Main Data Entry'!$D$23))*(-1)*'Main Data Entry'!$G$21,0))","v":0},null,59.963999999999999,null,null,null,null,null,null,null,null,43658.030937499891,59.974540710449219,448.13424682617188,59.974540710449219,448.13424682617188]
["T-40s",43658.030949073967,{"$f":"OFFSET($AE81,-$B$1,0)","v":59.974540710449219},{"$f":"OFFSET($AF81,-$B$1,0)","v":448.13424682617188},null,null,null,null,null,null,null,null,null,null,null,{"$f":"'Main Data Entry'!$G$21","v":0},{"$f":"IF($C81>(60+'Main Data Entry'!$D$23),(($C81-60-'Main Data Entry'!$D$23)/(60*'Main Data Entry'!$D$22-'Main Data Entry'!$D$23))*(-1)*'Main Data Entry'!$G$21,IF($C81<(60-'Main Data Entry'!$D$23),(($C81-60+'Main Data Entry'!$D$23)/(60*'Main Data Entry'!$D$22-'Main Data Entry'!$D$23))*(-1)*'Main Data Entry'!$G$21,0))","v":0},null,{"$f":"Grid_Nominal_Frequency-Expected_Deadband_Setting","v":59.963999999999999},null,null,null,null,null,null,null,null,{"$f":"AB82-TIME(0,0,1)","v":43658.030949073967},null,null,59.974540710449219,448.13424682617188]
["T-39s",43658.030960648044,59.974540710449219,448.13406372070313,null,null,null,null,null,null,null,null,null,null,null,{"$f":"'Main Data Entry'!$G$21","v":0},{"$f":"IF($C82>(60+'Main Data Entry'!$D$23),(($C82-60-'Main Data Entry'!$D$23)/(60*'Main Data Entry'!$D$22-'Main Data Entry'!$D$23))*(-1)*'Main Data Entry'!$G$21,IF($C82<(60-'Main Data Entry'!$D$23),(($C82-60+'Main Data Entry'!$D$23)/(60*'Main Data Entry'!$D$22-'Main Data Entry'!$D$23))*(-1)*'Main Data Entry'!$G$21,0))","v":0},null,59.963999999999999,null,null,null,null,null,null,null,null,43658.030960648044,59.974540710449219,448.13406372070313,59.974540710449219,448.13406372070313]
["T-38s",43658.030972222121,59.974540710449219,448.13406372070313,null,null,null,null,null,null,null,null,null,null,null,{"$f":"'Main Data Entry'!$G$21","v":0},{"$f":"IF($C83>(60+'Main Data Entry'!$D$23),(($C83-60-'Main Data Entry'!$D$23)/(60*'Main Data Entry'!$D$22-'Main Data Entry'!$D$23))*(-1)*'Main Data Entry'!$G$21,IF($C83<(60-'Main Data Entry'!$D$23),(($C83-60+'Main Data Entry'!$D$23)/(60*'Main Data Entry'!$D$22-'Main Data Entry'!$D$23))*(-1)*'Main Data Entry'!$G$21,0))","v":0},null,59.963999999999999,null,null,null,null,null,null,null,null,43658.030972222121,null,null,59.974540710449219,448.13406372070313]
["T-37s",43658.030983796198,59.974540710449219,448.13406372070313,null,null,null,null,null,null,null,null,null,null,null,{"$f":"'Main Data Entry'!$G$21","v":0},{"$f":"IF($C84>(60+'Main Data Entry'!$D$23),(($C84-60-'Main Data Entry'!$D$23)/(60*'Main Data Entry'!$D$22-'Main Data Entry'!$D$23))*(-1)*'Main Data Entry'!$G$21,IF($C84<(60-'Main Data Entry'!$D$23),(($C84-60+'Main Data Entry'!$D$23)/(60*'Main Data Entry'!$D$22-'Main Data Entry'!$D$23))*(-1)*'Main Data Entry'!$G$21,0))","v":0},null,59.963999999999999,null,null,null,null,null,null,null,null,43658.030983796198,59.974540710449219,448.13406372070313,59.974540710449219,448.13406372070313]
["T-36s",43658.030995370274,59.974540710449219,448.13406372070313,null,null,null,null,null,null,null,null,null,null,null,{"$f":"'Main Data Entry'!$G$21","v":0},{"$f":"IF($C85>(60+'Main Data Entry'!$D$23),(($C85-60-'Main Data Entry'!$D$23)/(60*'Main Data Entry'!$D$22-'Main Data Entry'!$D$23))*(-1)*'Main Data Entry'!$G$21,IF($C85<(60-'Main Data Entry'!$D$23),(($C85-60+'Main Data Entry'!$D$23)/(60*'Main Data Entry'!$D$22-'Main Data Entry'!$D$23))*(-1)*'Main Data Entry'!$G$21,0))","v":0},null,59.963999999999999,null,null,null,null,null,null,null,null,43658.030995370274,null,null,59.974540710449219,448.13406372070313]
["T-35s",43658.031006944351,59.974540710449219,448.13406372070313,null,null,null,null,null,null,null,null,null,null,null,{"$f":"'Main Data Entry'!$G$21","v":0},{"$f":"IF($C86>(60+'Main Data Entry'!$D$23),(($C86-60-'Main Data Entry'!$D$23)/(60*'Main Data Entry'!$D$22-'Main Data Entry'!$D$23))*(-1)*'Main Data Entry'!$G$21,IF($C86<(60-'Main Data Entry'!$D$23),(($C86-60+'Main Data Entry'!$D$23)/(60*'Main Data Entry'!$D$22-'Main Data Entry'!$D$23))*(-1)*'Main Data Entry'!$G$21,0))","v":0},null,59.963999999999999,null,null,null,null,null,null,null,null,43658.031006944351,59.974540710449219,448.13406372070313,59.974540710449219,448.13406372070313]
["T-34s",43658.031018518428,59.974540710449219,448.13406372070313,null,null,null,null,null,null,null,null,null,null,null,{"$f":"'Main Data Entry'!$G$21","v":0},{"$f":"IF($C87>(60+'Main Data Entry'!$D$23),(($C87-60-'Main Data Entry'!$D$23)/(60*'Main Data Entry'!$D$22-'Main Data Entry'!$D$23))*(-1)*'Main Data Entry'!$G$21,IF($C87<(60-'Main Data Entry'!$D$23),(($C87-60+'Main Data Entry'!$D$23)/(60*'Main Data Entry'!$D$22-'Main Data Entry'!$D$23))*(-1)*'Main Data Entry'!$G$21,0))","v":0},null,59.963999999999999,null,null,null,null,null,null,null,null,43658.031018518428,null,null,59.974540710449219,448.13406372070313]
["T-33s",43658.031030092505,59.978008270263672,448.32681274414063,null,null,null,null,null,null,null,null,null,null,null,{"$f":"'Main Data Entry'!$G$21","v":0},{"$f":"IF($C88>(60+'Main Data Entry'!$D$23),(($C88-60-'Main Data Entry'!$D$23)/(60*'Main Data Entry'!$D$22-'Main Data Entry'!$D$23))*(-1)*'Main Data Entry'!$G$21,IF($C88<(60-'Main Data Entry'!$D$23),(($C88-60+'Main Data Entry'!$D$23)/(60*'Main Data Entry'!$D$22-'Main Data Entry'!$D$23))*(-1)*'Main Data Entry'!$G$21,0))","v":0},null,59.963999999999999,null,null,null,null,null,null,null,null,43658.031030092505,59.978008270263672,448.32681274414063,59.978008270263672,448.32681274414063]
["T-32s",43658.031041666582,59.978008270263672,448.32681274414063,null,null,null,null,null,null,null,null,null,null,null,{"$f":"'Main Data Entry'!$G$21","v":0},{"$f":"IF($C89>(60+'Main Data Entry'!$D$23),(($C89-60-'Main Data Entry'!$D$23)/(60*'Main Data Entry'!$D$22-'Main Data Entry'!$D$23))*(-1)*'Main Data Entry'!$G$21,IF($C89<(60-'Main Data Entry'!$D$23),(($C89-60+'Main Data Entry'!$D$23)/(60*'Main Data Entry'!$D$22-'Main Data Entry'!$D$23))*(-1)*'Main Data Entry'!$G$21,0))","v":0},null,59.963999999999999,null,null,null,null,null,null,null,null,43658.031041666582,null,null,59.978008270263672,448.32681274414063]
["T-31s",43658.031053240658,59.978008270263672,448.32681274414063,null,null,null,null,null,null,null,null,null,null,null,{"$f":"'Main Data Entry'!$G$21","v":0},{"$f":"IF($C90>(60+'Main Data Entry'!$D$23),(($C90-60-'Main Data Entry'!$D$23)/(60*'Main Data Entry'!$D$22-'Main Data Entry'!$D$23))*(-1)*'Main Data Entry'!$G$21,IF($C90<(60-'Main Data Entry'!$D$23),(($C90-60+'Main Data Entry'!$D$23)/(60*'Main Data Entry'!$D$22-'Main Data Entry'!$D$23))*(-1)*'Main Data Entry'!$G$21,0))","v":0},null,59.963999999999999,null,null,null,null,null,null,null,null,43658.031053240658,59.978008270263672,448.32681274414063,59.978008270263672,448.32681274414063]
["T-30s",43658.031064814735,59.978008270263672,448.32681274414063,null,null,null,null,null,null,null,null,null,null,null,{"$f":"'Main Data Entry'!$G$21","v":0},{"$f":"IF($C91>(60+'Main Data Entry'!$D$23),(($C91-60-'Main Data Entry'!$D$23)/(60*'Main Data Entry'!$D$22-'Main Data Entry'!$D$23))*(-1)*'Main Data Entry'!$G$21,IF($C91<(60-'Main Data Entry'!$D$23),(($C91-60+'Main Data Entry'!$D$23)/(60*'Main Data Entry'!$D$22-'Main Data Entry'!$D$23))*(-1)*'Main Data Entry'!$G$21,0))","v":0},null,59.963999999999999,null,null,null,null,null,null,null,null,43658.031064814735,null,null,59.978008270263672,448.32681274414063]
["T-29s",43658.031076388812,59.978008270263672,448.32681274414063,null,null,null,null,null,null,null,null,null,null,null,{"$f":"'Main Data Entry'!$G$21","v":0},{"$f":"IF($C92>(60+'Main Data Entry'!$D$23),(($C92-60-'Main Data Entry'!$D$23)/(60*'Main Data Entry'!$D$22-'Main Data Entry'!$D$23))*(-1)*'Main Data Entry'!$G$21,IF($C92<(60-'Main Data Entry'!$D$23),(($C92-60+'Main Data Entry'!$D$23)/(60*'Main Data Entry'!$D$22-'Main Data Entry'!$D$23))*(-1)*'Main Data Entry'!$G$21,0))","v":0},null,59.963999999999999,null,null,null,null,null,null,null,null,43658.031076388812,59.978008270263672,448.32681274414063,59.978008270263672,448.32681274414063]
["T-28s",43658.031087962889,59.978008270263672,448.32681274414063,null,null,null,null,null,null,null,null,null,null,null,{"$f":"'Main Data Entry'!$G$21","v":0},{"$f":"IF($C93>(60+'Main Data Entry'!$D$23),(($C93-60-'Main Data Entry'!$D$23)/(60*'Main Data Entry'!$D$22-'Main Data Entry'!$D$23))*(-1)*'Main Data Entry'!$G$21,IF($C93<(60-'Main Data Entry'!$D$23),(($C93-60+'Main Data Entry'!$D$23)/(60*'Main Data Entry'!$D$22-'Main Data Entry'!$D$23))*(-1)*'Main Data Entry'!$G$21,0))","v":0},null,59.963999999999999,null,null,null,null,null,null,null,null,43658.031087962889,null,null,59.978008270263672,448.32681274414063]
["T-27s",43658.031099536965,59.978008270263672,448.32681274414063,null,null,null,null,null,null,null,null,null,null,null,{"$f":"'Main Data Entry'!$G$21","v":0},{"$f":"IF($C94>(60+'Main Data Entry'!$D$23),(($C94-60-'Main Data Entry'!$D$23)/(60*'Main Data Entry'!$D$22-'Main Data Entry'!$D$23))*(-1)*'Main Data Entry'!$G$21,IF($C94<(60-'Main Data Entry'!$D$23),(($C94-60+'Main Data Entry'!$D$23)/(60*'Main Data Entry'!$D$22-'Main Data Entry'!$D$23))*(-1)*'Main Data Entry'!$G$21,0))","v":0},null,59.963999999999999,null,null,null,null,null,null,null,null,43658.031099536965,59.978008270263672,448.32681274414063,59.978008270263672,448.32681274414063]
["T-26s",43658.031111111042,59.978008270263672,448.32681274414063,null,null,null,null,null,null,null,null,null,null,null,{"$f":"'Main Data Entry'!$G$21","v":0},{"$f":"IF($C95>(60+'Main Data Entry'!$D$23),(($C95-60-'Main Data Entry'!$D$23)/(60*'Main Data Entry'!$D$22-'Main Data Entry'!$D$23))*(-1)*'Main Data Entry'!$G$21,IF($C95<(60-'Main Data Entry'!$D$23),(($C95-60+'Main Data Entry'!$D$23)/(60*'Main Data Entry'!$D$22-'Main Data Entry'!$D$23))*(-1)*'Main Data Entry'!$G$21,0))","v":0},null,59.963999999999999,null,null,null,null,null,null,null,null,43658.031111111042,null,null,59.978008270263672,448.32681274414063]
["T-25s",43658.031122685119,59.984085083007813,447.93630981445313,null,null,null,null,null,null,null,null,null,null,null,{"$f":"'Main Data Entry'!$G$21","v":0},{"$f":"IF($C96>(60+'Main Data Entry'!$D$23),(($C96-60-'Main Data Entry'!$D$23)/(60*'Main Data Entry'!$D$22-'Main Data Entry'!$D$23))*(-1)*'Main Data Entry'!$G$21,IF($C96<(60-'Main Data Entry'!$D$23),(($C96-60+'Main Data Entry'!$D$23)/(60*'Main Data Entry'!$D$22-'Main Data Entry'!$D$23))*(-1)*'Main Data Entry'!$G$21,0))","v":0},null,59.963999999999999,null,null,null,null,null,null,null,null,43658.031122685119,59.984085083007813,447.93630981445313,59.984085083007813,447.93630981445313]
["T-24s",43658.031134259196,59.984085083007813,447.93630981445313,null,null,null,null,null,null,null,null,null,null,null,{"$f":"'Main Data Entry'!$G$21","v":0},{"$f":"IF($C97>(60+'Main Data Entry'!$D$23),(($C97-60-'Main Data Entry'!$D$23)/(60*'Main Data Entry'!$D$22-'Main Data Entry'!$D$23))*(-1)*'Main Data Entry'!$G$21,IF($C97<(60-'Main Data Entry'!$D$23),(($C97-60+'Main Data Entry'!$D$23)/(60*'Main Data Entry'!$D$22-'Main Data Entry'!$D$23))*(-1)*'Main Data Entry'!$G$21,0))","v":0},null,59.963999999999999,null,null,null,null,null,null,null,null,{"$f":"AB98-TIME(0,0,1)","v":43658.031134259196},null,null,59.984085083007813,447.93630981445313]
["T-23s",43658.031145833273,59.985866546630859,447.89569091796875,null,null,null,null,null,null,null,null,null,null,null,{"$f":"'Main Data Entry'!$G$21","v":0},{"$f":"IF($C98>(60+'Main Data Entry'!$D$23),(($C98-60-'Main Data Entry'!$D$23)/(60*'Main Data Entry'!$D$22-'Main Data Entry'!$D$23))*(-1)*'Main Data Entry'!$G$21,IF($C98<(60-'Main Data Entry'!$D$23),(($C98-60+'Main Data Entry'!$D$23)/(60*'Main Data Entry'!$D$22-'Main Data Entry'!$D$23))*(-1)*'Main Data Entry'!$G$21,0))","v":0},null,59.963999999999999,null,null,null,null,null,null,null,null,43658.031145833273,59.985866546630859,447.89569091796875,59.985866546630859,447.89569091796875]
["T-22s",43658.031157407349,59.985866546630859,447.89569091796875,null,null,null,null,null,null,null,null,null,null,null,{"$f":"'Main Data Entry'!$G$21","v":0},{"$f":"IF($C99>(60+'Main Data Entry'!$D$23),(($C99-60-'Main Data Entry'!$D$23)/(60*'Main Data Entry'!$D$22-'Main Data Entry'!$D$23))*(-1)*'Main Data Entry'!$G$21,IF($C99<(60-'Main Data Entry'!$D$23),(($C99-60+'Main Data Entry'!$D$23)/(60*'Main Data Entry'!$D$22-'Main Data Entry'!$D$23))*(-1)*'Main Data Entry'!$G$21,0))","v":0},null,59.963999999999999,null,null,null,null,null,null,null,null,43658.031157407349,null,null,59.985866546630859,447.89569091796875]
["T-21s",43658.031168981426,59.985866546630859,447.85650634765625,null,null,null,null,null,null,null,null,null,null,null,{"$f":"'Main Data Entry'!$G$21","v":0},{"$f":"IF($C100>(60+'Main Data Entry'!$D$23),(($C100-60-'Main Data Entry'!$D$23)/(60*'Main Data Entry'!$D$22-'Main Data Entry'!$D$23))*(-1)*'Main Data Entry'!$G$21,IF($C100<(60-'Main Data Entry'!$D$23),(($C100-60+'Main Data Entry'!$D$23)/(60*'Main Data Entry'!$D$22-'Main Data Entry'!$D$23))*(-1)*'Main Data Entry'!$G$21,0))","v":0},null,59.963999999999999,null,null,null,null,null,null,null,null,43658.031168981426,59.985866546630859,447.85650634765625,59.985866546630859,447.85650634765625]
["T-20s",43658.031180555503,59.985866546630859,447.85650634765625,null,null,null,null,null,null,null,null,null,null,null,{"$f":"'Main Data Entry'!$G$21","v":0},{"$f":"IF($C101>(60+'Main Data Entry'!$D$23),(($C101-60-'Main Data Entry'!$D$23)/(60*'Main Data Entry'!$D$22-'Main Data Entry'!$D$23))*(-1)*'Main Data Entry'!$G$21,IF($C101<(60-'Main Data Entry'!$D$23),(($C101-60+'Main Data Entry'!$D$23)/(60*'Main Data Entry'!$D$22-'Main Data Entry'!$D$23))*(-1)*'Main Data Entry'!$G$21,0))","v":0},null,59.963999999999999,null,null,null,null,null,null,null,null,43658.031180555503,null,null,59.985866546630859,447.85650634765625]
["T-19s",43658.03119212958,59.985866546630859,447.81729125976563,null,null,null,null,null,null,null,null,null,null,null,{"$f":"'Main Data Entry'!$G$21","v":0},{"$f":"IF($C102>(60+'Main Data Entry'!$D$23),(($C102-60-'Main Data Entry'!$D$23)/(60*'Main Data Entry'!$D$22-'Main Data Entry'!$D$23))*(-1)*'Main Data Entry'!$G$21,IF($C102<(60-'Main Data Entry'!$D$23),(($C102-60+'Main Data Entry'!$D$23)/(60*'Main Data Entry'!$D$22-'Main Data Entry'!$D$23))*(-1)*'Main Data Entry'!$G$21,0))","v":0},null,59.963999999999999,null,null,null,null,null,null,null,null,43658.03119212958,59.985866546630859,447.81729125976563,59.985866546630859,447.81729125976563]
["T-18s",43658.031203703657,59.985866546630859,447.81729125976563,null,null,null,null,null,null,null,null,null,null,null,{"$f":"'Main Data Entry'!$G$21","v":0},{"$f":"IF($C103>(60+'Main Data Entry'!$D$23),(($C103-60-'Main Data Entry'!$D$23)/(60*'Main Data Entry'!$D$22-'Main Data Entry'!$D$23))*(-1)*'Main Data Entry'!$G$21,IF($C103<(60-'Main Data Entry'!$D$23),(($C103-60+'Main Data Entry'!$D$23)/(60*'Main Data Entry'!$D$22-'Main Data Entry'!$D$23))*(-1)*'Main Data Entry'!$G$21,0))","v":0},null,59.963999999999999,null,null,null,null,null,null,null,null,43658.031203703657,null,null,59.985866546630859,447.81729125976563]
["T-17s",43658.031215277733,59.985862731933594,447.778076171875,null,null,null,null,null,null,null,null,null,null,null,{"$f":"'Main Data Entry'!$G$21","v":0},{"$f":"IF($C104>(60+'Main Data Entry'!$D$23),(($C104-60-'Main Data Entry'!$D$23)/(60*'Main Data Entry'!$D$22-'Main Data Entry'!$D$23))*(-1)*'Main Data Entry'!$G$21,IF($C104<(60-'Main Data Entry'!$D$23),(($C104-60+'Main Data Entry'!$D$23)/(60*'Main Data Entry'!$D$22-'Main Data Entry'!$D$23))*(-1)*'Main Data Entry'!$G$21,0))","v":0},null,59.963999999999999,null,null,null,null,null,null,null,null,43658.031215277733,59.985862731933594,447.778076171875,59.985862731933594,447.778076171875]
["T-16s",43658.03122685181,59.985862731933594,447.778076171875,{"$f":"AVERAGE($C$105:$C$119)","v":59.985491434733071},{"$f":"AVERAGE($D$105:$D$119)","v":448.19947509765626},null,{"$f":"E105","v":59.985491434733071},null,{"$f":"F105","v":448.19947509765626},null,null,null,null,null,{"$f":"'Main Data Entry'!$G$21","v":0},{"$f":"IF($C105>(60+'Main Data Entry'!$D$23),(($C105-60-'Main Data Entry'!$D$23)/(60*'Main Data Entry'!$D$22-'Main Data Entry'!$D$23))*(-1)*'Main Data Entry'!$G$21,IF($C105<(60-'Main Data Entry'!$D$23),(($C105-60+'Main Data Entry'!$D$23)/(60*'Main Data Entry'!$D$22-'Main Data Entry'!$D$23))*(-1)*'Main Data Entry'!$G$21,0))","v":0},{"$f":"AVERAGE($Q$105:$Q$119)","v":0},59.963999999999999,null,null,null,null,null,null,null,null,43658.03122685181,null,null,59.985862731933594,447.778076171875]
["T-15s",43658.031238425887,59.985862731933594,447.99041748046875,59.985491434733071,448.19947509765626,null,59.985491434733071,null,448.19947509765626,null,null,null,null,null,{"$f":"'Main Data Entry'!$G$21","v":0},{"$f":"IF($C106>(60+'Main Data Entry'!$D$23),(($C106-60-'Main Data Entry'!$D$23)/(60*'Main Data Entry'!$D$22-'Main Data Entry'!$D$23))*(-1)*'Main Data Entry'!$G$21,IF($C106<(60-'Main Data Entry'!$D$23),(($C106-60+'Main Data Entry'!$D$23)/(60*'Main Data Entry'!$D$22-'Main Data Entry'!$D$23))*(-1)*'Main Data Entry'!$G$21,0))","v":0},0,59.963999999999999,null,null,null,null,null,null,null,null,43658.031238425887,59.985862731933594,447.99041748046875,59.985862731933594,447.99041748046875]
["T-14s",43658.031249999964,59.985862731933594,447.99041748046875,59.985491434733071,448.19947509765626,null,59.985491434733071,null,448.19947509765626,null,null,null,null,null,{"$f":"'Main Data Entry'!$G$21","v":0},{"$f":"IF($C107>(60+'Main Data Entry'!$D$23),(($C107-60-'Main Data Entry'!$D$23)/(60*'Main Data Entry'!$D$22-'Main Data Entry'!$D$23))*(-1)*'Main Data Entry'!$G$21,IF($C107<(60-'Main Data Entry'!$D$23),(($C107-60+'Main Data Entry'!$D$23)/(60*'Main Data Entry'!$D$22-'Main Data Entry'!$D$23))*(-1)*'Main Data Entry'!$G$21,0))","v":0},0,59.963999999999999,null,null,null,null,null,null,null,null,43658.031249999964,null,null,59.985862731933594,447.99041748046875]
["T-13s",43658.03126157404,59.985599517822266,448.203369140625,59.985491434733071,448.19947509765626,null,59.985491434733071,null,448.19947509765626,null,null,null,null,null,{"$f":"'Main Data Entry'!$G$21","v":0},{"$f":"IF($C108>(60+'Main Data Entry'!$D$23),(($C108-60-'Main Data Entry'!$D$23)/(60*'Main Data Entry'!$D$22-'Main Data Entry'!$D$23))*(-1)*'Main Data Entry'!$G$21,IF($C108<(60-'Main Data Entry'!$D$23),(($C108-60+'Main Data Entry'!$D$23)/(60*'Main Data Entry'!$D$22-'Main Data Entry'!$D$23))*(-1)*'Main Data Entry'!$G$21,0))","v":0},0,59.963999999999999,null,null,null,null,null,null,null,null,43658.03126157404,59.985599517822266,448.203369140625,59.985599517822266,448.203369140625]
["T-12s",43658.031273148117,59.985599517822266,448.203369140625,59.985491434733071,448.19947509765626,null,59.985491434733071,null,448.19947509765626,null,null,null,null,null,{"$f":"'Main Data Entry'!$G$21","v":0},{"$f":"IF($C109>(60+'Main Data Entry'!$D$23),(($C109-60-'Main Data Entry'!$D$23)/(60*'Main Data Entry'!$D$22-'Main Data Entry'!$D$23))*(-1)*'Main Data Entry'!$G$21,IF($C109<(60-'Main Data Entry'!$D$23),(($C109-60+'Main Data Entry'!$D$23)/(60*'Main Data Entry'!$D$22-'Main Data Entry'!$D$23))*(-1)*'Main Data Entry'!$G$21,0))","v":0},0,59.963999999999999,null,null,null,null,null,null,null,null,43658.031273148117,null,null,59.985599517822266,448.203369140625]
["T-11s",43658.031284722194,59.985336303710938,448.23028564453125,59.985491434733071,448.19947509765626,null,59.985491434733071,null,448.19947509765626,null,null,null,null,null,{"$f":"'Main Data Entry'!$G$21","v":0},{"$f":"IF($C110>(60+'Main Data Entry'!$D$23),(($C110-60-'Main Data Entry'!$D$23)/(60*'Main Data Entry'!$D$22-'Main Data Entry'!$D$23))*(-1)*'Main Data Entry'!$G$21,IF($C110<(60-'Main Data Entry'!$D$23),(($C110-60+'Main Data Entry'!$D$23)/(60*'Main Data Entry'!$D$22-'Main Data Entry'!$D$23))*(-1)*'Main Data Entry'!$G$21,0))","v":0},0,59.963999999999999,null,null,null,null,null,null,null,null,43658.031284722194,59.985336303710938,448.23028564453125,59.985336303710938,448.23028564453125]
["T-10s",43658.031296296271,59.985336303710938,448.23028564453125,59.985491434733071,448.19947509765626,null,59.985491434733071,null,448.19947509765626,null,null,null,null,null,{"$f":"'Main Data Entry'!$G$21","v":0},{"$f":"IF($C111>(60+'Main Data Entry'!$D$23),(($C111-60-'Main Data Entry'!$D$23)/(60*'Main Data Entry'!$D$22-'Main Data Entry'!$D$23))*(-1)*'Main Data Entry'!$G$21,IF($C111<(60-'Main Data Entry'!$D$23),(($C111-60+'Main Data Entry'!$D$23)/(60*'Main Data Entry'!$D$22-'Main Data Entry'!$D$23))*(-1)*'Main Data Entry'!$G$21,0))","v":0},0,59.963999999999999,null,null,null,null,null,null,null,null,43658.031296296271,null,null,59.985336303710938,448.23028564453125]
["T-9s",43658.031307870348,59.985073089599609,448.2564697265625,59.985491434733071,448.19947509765626,null,59.985491434733071,null,448.19947509765626,null,null,null,null,null,{"$f":"'Main Data Entry'!$G$21","v":0},{"$f":"IF($C112>(60+'Main Data Entry'!$D$23),(($C112-60-'Main Data Entry'!$D$23)/(60*'Main Data Entry'!$D$22-'Main Data Entry'!$D$23))*(-1)*'Main Data Entry'!$G$21,IF($C112<(60-'Main Data Entry'!$D$23),(($C112-60+'Main Data Entry'!$D$23)/(60*'Main Data Entry'!$D$22-'Main Data Entry'!$D$23))*(-1)*'Main Data Entry'!$G$21,0))","v":0},0,59.963999999999999,null,null,null,null,null,null,null,null,43658.031307870348,59.985073089599609,448.2564697265625,59.985073089599609,448.2564697265625]
["T-8s",43658.031319444424,{"$f":"OFFSET($AE113,-$B$1,0)","v":59.985073089599609},{"$f":"OFFSET($AF113,-$B$1,0)","v":448.2564697265625},59.985491434733071,448.19947509765626,null,59.985491434733071,null,448.19947509765626,null,null,null,null,null,{"$f":"'Main Data Entry'!$G$21","v":0},{"$f":"IF($C113>(60+'Main Data Entry'!$D$23),(($C113-60-'Main Data Entry'!$D$23)/(60*'Main Data Entry'!$D$22-'Main Data Entry'!$D$23))*(-1)*'Main Data Entry'!$G$21,IF($C113<(60-'Main Data Entry'!$D$23),(($C113-60+'Main Data Entry'!$D$23)/(60*'Main Data Entry'!$D$22-'Main Data Entry'!$D$23))*(-1)*'Main Data Entry'!$G$21,0))","v":0},0,{"$f":"Grid_Nominal_Frequency-Expected_Deadband_Setting","v":59.963999999999999},null,null,null,null,null,null,null,null,{"$f":"AB114-TIME(0,0,1)","v":43658.031319444424},null,null,59.985073089599609,448.2564697265625]
["T-7s",{"$f":"B115-TIME(0,0,1)","v":43658.031331018501},59.984806060791016,448.28265380859375,59.985491434733071,448.19947509765626,null,59.985491434733071,null,448.19947509765626,null,null,null,null,null,{"$f":"'Main Data Entry'!$G$21","v":0},{"$f":"IF($C114>(60+'Main Data Entry'!$D$23),(($C114-60-'Main Data Entry'!$D$23)/(60*'Main Data Entry'!$D$22-'Main Data Entry'!$D$23))*(-1)*'Main Data Entry'!$G$21,IF($C114<(60-'Main Data Entry'!$D$23),(($C114-60+'Main Data Entry'!$D$23)/(60*'Main Data Entry'!$D$22-'Main Data Entry'!$D$23))*(-1)*'Main Data Entry'!$G$21,0))","v":0},0,59.963999999999999,null,null,null,null,null,null,null,null,43658.031331018501,59.984806060791016,448.28265380859375,59.984806060791016,448.28265380859375]
["T-6s",43658.031342592578,59.984806060791016,448.28265380859375,59.985491434733071,448.19947509765626,null,59.985491434733071,null,448.19947509765626,null,null,null,null,null,{"$f":"'Main Data Entry'!$G$21","v":0},{"$f":"IF($C115>(60+'Main Data Entry'!$D$23),(($C115-60-'Main Data Entry'!$D$23)/(60*'Main Data Entry'!$D$22-'Main Data Entry'!$D$23))*(-1)*'Main Data Entry'!$G$21,IF($C115<(60-'Main Data Entry'!$D$23),(($C115-60+'Main Data Entry'!$D$23)/(60*'Main Data Entry'!$D$22-'Main Data Entry'!$D$23))*(-1)*'Main Data Entry'!$G$21,0))","v":0},0,59.963999999999999,null,null,null,null,null,null,null,null,43658.031342592578,null,null,59.984806060791016,448.28265380859375]
["T-5s",43658.031354166655,59.984542846679688,448.308837890625,59.985491434733071,448.19947509765626,null,59.985491434733071,null,448.19947509765626,null,null,null,null,null,{"$f":"'Main Data Entry'!$G$21","v":0},{"$f":"IF($C116>(60+'Main Data Entry'!$D$23),(($C116-60-'Main Data Entry'!$D$23)/(60*'Main Data Entry'!$D$22-'Main Data Entry'!$D$23))*(-1)*'Main Data Entry'!$G$21,IF($C116<(60-'Main Data Entry'!$D$23),(($C116-60+'Main Data Entry'!$D$23)/(60*'Main Data Entry'!$D$22-'Main Data Entry'!$D$23))*(-1)*'Main Data Entry'!$G$21,0))","v":0},0,59.963999999999999,null,null,null,null,null,null,null,null,43658.031354166655,59.984542846679688,448.308837890625,59.984542846679688,448.308837890625]
["T-4s",43658.031365740731,59.984542846679688,448.308837890625,59.985491434733071,448.19947509765626,null,59.985491434733071,null,448.19947509765626,null,null,null,null,null,{"$f":"'Main Data Entry'!$G$21","v":0},{"$f":"IF($C117>(60+'Main Data Entry'!$D$23),(($C117-60-'Main Data Entry'!$D$23)/(60*'Main Data Entry'!$D$22-'Main Data Entry'!$D$23))*(-1)*'Main Data Entry'!$G$21,IF($C117<(60-'Main Data Entry'!$D$23),(($C117-60+'Main Data Entry'!$D$23)/(60*'Main Data Entry'!$D$22-'Main Data Entry'!$D$23))*(-1)*'Main Data Entry'!$G$21,0))","v":0},0,59.963999999999999,null,null,null,null,null,null,null,null,43658.031365740731,null,null,59.984542846679688,448.308837890625]
["T-3s",43658.031377314808,59.987033843994141,448.33499145507813,59.985491434733071,448.19947509765626,null,59.985491434733071,null,448.19947509765626,null,null,null,null,null,{"$f":"'Main Data Entry'!$G$21","v":0},{"$f":"IF($C118>(60+'Main Data Entry'!$D$23),(($C118-60-'Main Data Entry'!$D$23)/(60*'Main Data Entry'!$D$22-'Main Data Entry'!$D$23))*(-1)*'Main Data Entry'!$G$21,IF($C118<(60-'Main Data Entry'!$D$23),(($C118-60+'Main Data Entry'!$D$23)/(60*'Main Data Entry'!$D$22-'Main Data Entry'!$D$23))*(-1)*'Main Data Entry'!$G$21,0))","v":0},0,59.963999999999999,null,null,null,null,null,null,null,null,43658.031377314808,59.987033843994141,448.33499145507813,59.987033843994141,448.33499145507813]
["T-2s",43658.031388888885,59.987033843994141,448.33499145507813,59.985491434733071,448.19947509765626,null,59.985491434733071,null,448.19947509765626,null,null,null,null,null,{"$f":"'Main Data Entry'!$G$21","v":0},{"$f":"IF($C119>(60+'Main Data Entry'!$D$23),(($C119-60-'Main Data Entry'!$D$23)/(60*'Main Data Entry'!$D$22-'Main Data Entry'!$D$23))*(-1)*'Main Data Entry'!$G$21,IF($C119<(60-'Main Data Entry'!$D$23),(($C119-60+'Main Data Entry'!$D$23)/(60*'Main Data Entry'!$D$22-'Main Data Entry'!$D$23))*(-1)*'Main Data Entry'!$G$21,0))","v":0},0,59.963999999999999,null,null,null,null,null,null,null,null,43658.031388888885,null,null,59.987033843994141,448.33499145507813]
["T-1s",43658.031400462962,59.987041473388672,448.36117553710938,null,null,-1000000000,null,null,null,null,null,null,null,null,{"$f":"'Main Data Entry'!$G$21","v":0},{"$f":"IF($C120>(60+'Main Data Entry'!$D$23),(($C120-60-'Main Data Entry'!$D$23)/(60*'Main Data Entry'!$D$22-'Main Data Entry'!$D$23))*(-1)*'Main Data Entry'!$G$21,IF($C120<(60-'Main Data Entry'!$D$23),(($C120-60+'Main Data Entry'!$D$23)/(60*'Main Data Entry'!$D$22-'Main Data Entry'!$D$23))*(-1)*'Main Data Entry'!$G$21,0))","v":0},null,59.963999999999999,null,null,null,null,null,null,null,null,43658.031400462962,59.987041473388672,448.36117553710938,59.987041473388672,448.36117553710938]
["T=0",{"$f":"$P$2+IF($B$1>0,-TIME(0,0,ABS($B$1)),+TIME(0,0,ABS($B$1)))","v":43658.031412037039},59.987041473388672,448.36117553710938,null,null,60,null,null,null,null,null,null,null,null,{"$f":"'Main Data Entry'!$G$21","v":0},{"$f":"IF($C121>(60+'Main Data Entry'!$D$23),(($C121-60-'Main Data Entry'!$D$23)/(60*'Main Data Entry'!$D$22-'Main Data Entry'!$D$23))*(-1)*'Main Data Entry'!$G$21,IF($C121<(60-'Main Data Entry'!$D$23),(($C121-60+'Main Data Entry'!$D$23)/(60*'Main Data Entry'!$D$22-'Main Data Entry'!$D$23))*(-1)*'Main Data Entry'!$G$21,0))","v":0},null,59.963999999999999,null,null,null,null,null,null,null,null,{"$f":"$P$2","v":43658.031412037039},null,null,59.987041473388672,448.36117553710938]
["T+1s",{"$f":"B121+TIME(0,0,1)","v":43658.031423611115},59.987041473388672,448.38735961914063,null,null,1000000000,null,null,null,null,null,null,null,null,{"$f":"'Main Data Entry'!$G$21","v":0},{"$f":"IF($C122>(60+'Main Data Entry'!$D$23),(($C122-60-'Main Data Entry'!$D$23)/(60*'Main Data Entry'!$D$22-'Main Data Entry'!$D$23))*(-1)*'Main Data Entry'!$G$21,IF($C122<(60-'Main Data Entry'!$D$23),(($C122-60+'Main Data Entry'!$D$23)/(60*'Main Data Entry'!$D$22-'Main Data Entry'!$D$23))*(-1)*'Main Data Entry'!$G$21,0))","v":0},null,59.963999999999999,null,null,null,null,null,null,null,null,{"$f":"AB121+TIME(0,0,1)","v":43658.031423611115},59.987041473388672,448.38735961914063,59.987041473388672,448.38735961914063]
["T+2s",{"$f":"B122+TIME(0,0,1)","v":43658.031435185192},59.987041473388672,448.38735961914063,null,null,null,null,null,null,null,null,null,null,null,{"$f":"'Main Data Entry'!$G$21","v":0},{"$f":"IF($C123>(60+'Main Data Entry'!$D$23),(($C123-60-'Main Data Entry'!$D$23)/(60*'Main Data Entry'!$D$22-'Main Data Entry'!$D$23))*(-1)*'Main Data Entry'!$G$21,IF($C123<(60-'Main Data Entry'!$D$23),(($C123-60+'Main Data Entry'!$D$23)/(60*'Main Data Entry'!$D$22-'Main Data Entry'!$D$23))*(-1)*'Main Data Entry'!$G$21,0))","v":0},null,59.963999999999999,null,null,null,null,null,null,null,null,43658.031435185192,null,null,59.987041473388672,448.38735961914063]
["T+3s",43658.031446759269,59.987041473388672,448.41354370117188,null,null,null,null,null,null,null,null,null,null,null,{"$f":"'Main Data Entry'!$G$21","v":0},{"$f":"IF($C124>(60+'Main Data Entry'!$D$23),(($C124-60-'Main Data Entry'!$D$23)/(60*'Main Data Entry'!$D$22-'Main Data Entry'!$D$23))*(-1)*'Main Data Entry'!$G$21,IF($C124<(60-'Main Data Entry'!$D$23),(($C124-60+'Main Data Entry'!$D$23)/(60*'Main Data Entry'!$D$22-'Main Data Entry'!$D$23))*(-1)*'Main Data Entry'!$G$21,0))","v":0},null,59.963999999999999,null,null,null,null,null,null,null,null,43658.031446759269,59.987041473388672,448.41354370117188,59.987041473388672,448.41354370117188]
["T+4s",43658.031458333346,59.987041473388672,448.41354370117188,null,null,null,null,null,null,null,null,null,null,null,{"$f":"'Main Data Entry'!$G$21","v":0},{"$f":"IF($C125>(60+'Main Data Entry'!$D$23),(($C125-60-'Main Data Entry'!$D$23)/(60*'Main Data Entry'!$D$22-'Main Data Entry'!$D$23))*(-1)*'Main Data Entry'!$G$21,IF($C125<(60-'Main Data Entry'!$D$23),(($C125-60+'Main Data Entry'!$D$23)/(60*'Main Data Entry'!$D$22-'Main Data Entry'!$D$23))*(-1)*'Main Data Entry'!$G$21,0))","v":0},null,59.963999999999999,null,null,null,null,null,null,null,null,43658.031458333346,null,null,59.987041473388672,448.41354370117188]
["T+5s",43658.031469907422,59.988674163818359,448.439697265625,null,null,null,null,null,null,null,null,null,null,null,{"$f":"'Main Data Entry'!$G$21","v":0},{"$f":"IF($C126>(60+'Main Data Entry'!$D$23),(($C126-60-'Main Data Entry'!$D$23)/(60*'Main Data Entry'!$D$22-'Main Data Entry'!$D$23))*(-1)*'Main Data Entry'!$G$21,IF($C126<(60-'Main Data Entry'!$D$23),(($C126-60+'Main Data Entry'!$D$23)/(60*'Main Data Entry'!$D$22-'Main Data Entry'!$D$23))*(-1)*'Main Data Entry'!$G$21,0))","v":0},null,59.963999999999999,null,null,null,null,null,null,null,null,43658.031469907422,59.988674163818359,448.439697265625,59.988674163818359,448.439697265625]
["T+6s",43658.031481481499,59.988674163818359,448.439697265625,null,null,null,null,null,null,null,null,null,null,null,{"$f":"'Main Data Entry'!$G$21","v":0},{"$f":"IF($C127>(60+'Main Data Entry'!$D$23),(($C127-60-'Main Data Entry'!$D$23)/(60*'Main Data Entry'!$D$22-'Main Data Entry'!$D$23))*(-1)*'Main Data Entry'!$G$21,IF($C127<(60-'Main Data Entry'!$D$23),(($C127-60+'Main Data Entry'!$D$23)/(60*'Main Data Entry'!$D$22-'Main Data Entry'!$D$23))*(-1)*'Main Data Entry'!$G$21,0))","v":0},null,59.963999999999999,null,null,null,null,null,null,null,null,43658.031481481499,null,null,59.988674163818359,448.439697265625]
["T+7s",43658.031493055576,59.988349914550781,448.26205444335938,null,null,null,null,null,null,null,null,null,null,null,{"$f":"'Main Data Entry'!$G$21","v":0},{"$f":"IF($C128>(60+'Main Data Entry'!$D$23),(($C128-60-'Main Data Entry'!$D$23)/(60*'Main Data Entry'!$D$22-'Main Data Entry'!$D$23))*(-1)*'Main Data Entry'!$G$21,IF($C128<(60-'Main Data Entry'!$D$23),(($C128-60+'Main Data Entry'!$D$23)/(60*'Main Data Entry'!$D$22-'Main Data Entry'!$D$23))*(-1)*'Main Data Entry'!$G$21,0))","v":0},null,59.963999999999999,null,null,null,null,null,null,null,null,43658.031493055576,59.988349914550781,448.26205444335938,59.988349914550781,448.26205444335938]
["T+8s",43658.031504629653,59.988349914550781,448.26205444335938,null,null,null,null,null,null,null,null,null,null,null,{"$f":"'Main Data Entry'!$G$21","v":0},{"$f":"IF($C129>(60+'Main Data Entry'!$D$23),(($C129-60-'Main Data Entry'!$D$23)/(60*'Main Data Entry'!$D$22-'Main Data Entry'!$D$23))*(-1)*'Main Data Entry'!$G$21,IF($C129<(60-'Main Data Entry'!$D$23),(($C129-60+'Main Data Entry'!$D$23)/(60*'Main Data Entry'!$D$22-'Main Data Entry'!$D$23))*(-1)*'Main Data Entry'!$G$21,0))","v":0},null,59.963999999999999,null,null,null,null,null,null,null,null,43658.031504629653,null,null,59.988349914550781,448.26205444335938]
["T+9s",43658.03151620373,59.988018035888672,448.26187133789063,null,null,null,null,null,null,null,null,null,null,null,{"$f":"'Main Data Entry'!$G$21","v":0},{"$f":"IF($C130>(60+'Main Data Entry'!$D$23),(($C130-60-'Main Data Entry'!$D$23)/(60*'Main Data Entry'!$D$22-'Main Data Entry'!$D$23))*(-1)*'Main Data Entry'!$G$21,IF($C130<(60-'Main Data Entry'!$D$23),(($C130-60+'Main Data Entry'!$D$23)/(60*'Main Data Entry'!$D$22-'Main Data Entry'!$D$23))*(-1)*'Main Data Entry'!$G$21,0))","v":0},null,59.963999999999999,null,null,null,null,null,null,null,null,43658.03151620373,59.988018035888672,448.26187133789063,59.988018035888672,448.26187133789063]
["T+10s",43658.031527777806,59.988018035888672,448.26187133789063,null,null,null,null,null,null,null,null,null,null,null,{"$f":"'Main Data Entry'!$G$21","v":0},{"$f":"IF($C131>(60+'Main Data Entry'!$D$23),(($C131-60-'Main Data Entry'!$D$23)/(60*'Main Data Entry'!$D$22-'Main Data Entry'!$D$23))*(-1)*'Main Data Entry'!$G$21,IF($C131<(60-'Main Data Entry'!$D$23),(($C131-60+'Main Data Entry'!$D$23)/(60*'Main Data Entry'!$D$22-'Main Data Entry'!$D$23))*(-1)*'Main Data Entry'!$G$21,0))","v":0},null,59.963999999999999,null,null,null,null,null,null,null,null,43658.031527777806,null,null,59.988018035888672,448.26187133789063]
["T+11s",43658.031539351883,59.987689971923828,448.26187133789063,null,null,null,null,null,null,null,null,null,null,null,{"$f":"'Main Data Entry'!$G$21","v":0},{"$f":"IF($C132>(60+'Main Data Entry'!$D$23),(($C132-60-'Main Data Entry'!$D$23)/(60*'Main Data Entry'!$D$22-'Main Data Entry'!$D$23))*(-1)*'Main Data Entry'!$G$21,IF($C132<(60-'Main Data Entry'!$D$23),(($C132-60+'Main Data Entry'!$D$23)/(60*'Main Data Entry'!$D$22-'Main Data Entry'!$D$23))*(-1)*'Main Data Entry'!$G$21,0))","v":0},null,59.963999999999999,null,null,null,null,null,null,null,null,43658.031539351883,59.987689971923828,448.26187133789063,59.987689971923828,448.26187133789063]
["T+12s",43658.03155092596,59.987689971923828,448.26187133789063,null,null,null,null,null,null,null,null,null,null,null,{"$f":"'Main Data Entry'!$G$21","v":0},{"$f":"IF($C133>(60+'Main Data Entry'!$D$23),(($C133-60-'Main Data Entry'!$D$23)/(60*'Main Data Entry'!$D$22-'Main Data Entry'!$D$23))*(-1)*'Main Data Entry'!$G$21,IF($C133<(60-'Main Data Entry'!$D$23),(($C133-60+'Main Data Entry'!$D$23)/(60*'Main Data Entry'!$D$22-'Main Data Entry'!$D$23))*(-1)*'Main Data Entry'!$G$21,0))","v":0},null,59.963999999999999,null,null,null,null,null,null,null,null,43658.03155092596,null,null,59.987689971923828,448.26187133789063]
["T+13s",43658.031562500037,59.987358093261719,448.26187133789063,null,null,null,null,null,null,null,null,null,null,null,{"$f":"'Main Data Entry'!$G$21","v":0},{"$f":"IF($C134>(60+'Main Data Entry'!$D$23),(($C134-60-'Main Data Entry'!$D$23)/(60*'Main Data Entry'!$D$22-'Main Data Entry'!$D$23))*(-1)*'Main Data Entry'!$G$21,IF($C134<(60-'Main Data Entry'!$D$23),(($C134-60+'Main Data Entry'!$D$23)/(60*'Main Data Entry'!$D$22-'Main Data Entry'!$D$23))*(-1)*'Main Data Entry'!$G$21,0))","v":0},null,59.963999999999999,null,null,null,null,null,null,null,null,43658.031562500037,59.987358093261719,448.26187133789063,59.987358093261719,448.26187133789063]
["T+14s",43658.031574074113,59.987358093261719,448.26187133789063,null,null,null,null,null,null,null,null,null,null,null,{"$f":"'Main Data Entry'!$G$21","v":0},{"$f":"IF($C135>(60+'Main Data Entry'!$D$23),(($C135-60-'Main Data Entry'!$D$23)/(60*'Main Data Entry'!$D$22-'Main Data Entry'!$D$23))*(-1)*'Main Data Entry'!$G$21,IF($C135<(60-'Main Data Entry'!$D$23),(($C135-60+'Main Data Entry'!$D$23)/(60*'Main Data Entry'!$D$22-'Main Data Entry'!$D$23))*(-1)*'Main Data Entry'!$G$21,0))","v":0},null,59.963999999999999,null,null,null,null,null,null,null,null,43658.031574074113,null,null,59.987358093261719,448.26187133789063]
["T+15s",43658.03158564819,59.969127655029297,448.77642822265625,null,null,null,null,null,null,null,null,null,null,null,{"$f":"'Main Data Entry'!$G$21","v":0},{"$f":"IF($C136>(60+'Main Data Entry'!$D$23),(($C136-60-'Main Data Entry'!$D$23)/(60*'Main Data Entry'!$D$22-'Main Data Entry'!$D$23))*(-1)*'Main Data Entry'!$G$21,IF($C136<(60-'Main Data Entry'!$D$23),(($C136-60+'Main Data Entry'!$D$23)/(60*'Main Data Entry'!$D$22-'Main Data Entry'!$D$23))*(-1)*'Main Data Entry'!$G$21,0))","v":0},null,59.963999999999999,null,null,null,null,null,null,null,null,43658.03158564819,59.969127655029297,448.77642822265625,59.969127655029297,448.77642822265625]
["T+16s",43658.031597222267,59.969127655029297,448.77642822265625,null,null,null,null,null,null,null,null,null,null,null,{"$f":"'Main Data Entry'!$G$21","v":0},{"$f":"IF($C137>(60+'Main Data Entry'!$D$23),(($C137-60-'Main Data Entry'!$D$23)/(60*'Main Data Entry'!$D$22-'Main Data Entry'!$D$23))*(-1)*'Main Data Entry'!$G$21,IF($C137<(60-'Main Data Entry'!$D$23),(($C137-60+'Main Data Entry'!$D$23)/(60*'Main Data Entry'!$D$22-'Main Data Entry'!$D$23))*(-1)*'Main Data Entry'!$G$21,0))","v":0},null,59.963999999999999,null,null,null,null,null,null,null,null,43658.031597222267,null,null,59.969127655029297,448.77642822265625]
["T+17s",43658.031608796344,59.950889587402344,450.3499755859375,null,null,null,null,null,null,null,null,null,null,null,{"$f":"'Main Data Entry'!$G$21","v":0},{"$f":"IF($C138>(60+'Main Data Entry'!$D$23),(($C138-60-'Main Data Entry'!$D$23)/(60*'Main Data Entry'!$D$22-'Main Data Entry'!$D$23))*(-1)*'Main Data Entry'!$G$21,IF($C138<(60-'Main Data Entry'!$D$23),(($C138-60+'Main Data Entry'!$D$23)/(60*'Main Data Entry'!$D$22-'Main Data Entry'!$D$23))*(-1)*'Main Data Entry'!$G$21,0))","v":0},null,59.963999999999999,null,null,null,null,null,null,null,null,{"$f":"AB137+TIME(0,0,1)","v":43658.031608796344},59.950889587402344,450.3499755859375,59.950889587402344,450.3499755859375]
["T+18s",43658.031620370421,59.950889587402344,450.3499755859375,null,null,null,null,null,null,null,null,null,null,null,{"$f":"'Main Data Entry'!$G$21","v":0},{"$f":"IF($C139>(60+'Main Data Entry'!$D$23),(($C139-60-'Main Data Entry'!$D$23)/(60*'Main Data Entry'!$D$22-'Main Data Entry'!$D$23))*(-1)*'Main Data Entry'!$G$21,IF($C139<(60-'Main Data Entry'!$D$23),(($C139-60+'Main Data Entry'!$D$23)/(60*'Main Data Entry'!$D$22-'Main Data Entry'!$D$23))*(-1)*'Main Data Entry'!$G$21,0))","v":0},null,59.963999999999999,null,null,null,null,null,null,null,null,43658.031620370421,null,null,59.950889587402344,450.3499755859375]
["T+19s",43658.031631944497,59.944736480712891,453.3482666015625,null,null,null,null,null,null,null,null,null,null,null,{"$f":"'Main Data Entry'!$G$21","v":0},{"$f":"IF($C140>(60+'Main Data Entry'!$D$23),(($C140-60-'Main Data Entry'!$D$23)/(60*'Main Data Entry'!$D$22-'Main Data Entry'!$D$23))*(-1)*'Main Data Entry'!$G$21,IF($C140<(60-'Main Data Entry'!$D$23),(($C140-60+'Main Data Entry'!$D$23)/(60*'Main Data Entry'!$D$22-'Main Data Entry'!$D$23))*(-1)*'Main Data Entry'!$G$21,0))","v":0},null,59.963999999999999,null,null,null,null,null,null,null,null,43658.031631944497,59.944736480712891,453.3482666015625,{"$f":"IF($AC140=\"\",$AE139,IF($AC140<>$AE139,$AC140,$AE139))","v":59.944736480712891},{"$f":"IF($AD140=\"\",$AF139,IF($AD140<>$AF139,$AD140,$AF139))","v":453.3482666015625}]
["T+20s",43658.031643518574,59.944736480712891,453.3482666015625,{"$f":"AVERAGE($C$141:$C$173)","v":59.950757460160688},{"$f":"AVERAGE($D$141:$D$173)","v":454.29945697206438},null,null,{"$f":"E141","v":59.950757460160688},null,{"$f":"F141","v":454.29945697206438},{"$f":"P$12+P$17","v":454.52117511171281},{"$f":"P$12+P$21","v":448.19947509765626},null,null,{"$f":"'Main Data Entry'!$G$21","v":0},{"$f":"IF($C141>(60+'Main Data Entry'!$D$23),(($C141-60-'Main Data Entry'!$D$23)/(60*'Main Data Entry'!$D$22-'Main Data Entry'!$D$23))*(-1)*'Main Data Entry'!$G$21,IF($C141<(60-'Main Data Entry'!$D$23),(($C141-60+'Main Data Entry'!$D$23)/(60*'Main Data Entry'!$D$22-'Main Data Entry'!$D$23))*(-1)*'Main Data Entry'!$G$21,0))","v":0},{"$f":"AVERAGE($Q$141:$Q$173)","v":0},59.963999999999999,null,null,null,null,null,null,null,null,43658.031643518574,null,null,59.944736480712891,453.3482666015625]
["T+21s",43658.031655092651,59.945083618164063,453.3482666015625,59.950757460160688,454.29945697206438,null,null,59.950757460160688,null,454.29945697206438,{"$f":"P$12+P$17","v":454.52117511171281},{"$f":"P$12+P$21","v":448.19947509765626},null,null,{"$f":"'Main Data Entry'!$G$21","v":0},{"$f":"IF($C142>(60+'Main Data Entry'!$D$23),(($C142-60-'Main Data Entry'!$D$23)/(60*'Main Data Entry'!$D$22-'Main Data Entry'!$D$23))*(-1)*'Main Data Entry'!$G$21,IF($C142<(60-'Main Data Entry'!$D$23),(($C142-60+'Main Data Entry'!$D$23)/(60*'Main Data Entry'!$D$22-'Main Data Entry'!$D$23))*(-1)*'Main Data Entry'!$G$21,0))","v":0},0,59.963999999999999,null,null,null,null,null,null,null,null,43658.031655092651,59.945083618164063,453.3482666015625,59.945083618164063,453.3482666015625]
["T+22s",43658.031666666728,59.945083618164063,453.3482666015625,59.950757460160688,454.29945697206438,null,null,59.950757460160688,null,454.29945697206438,454.52117511171281,448.19947509765626,null,null,{"$f":"'Main Data Entry'!$G$21","v":0},{"$f":"IF($C143>(60+'Main Data Entry'!$D$23),(($C143-60-'Main Data Entry'!$D$23)/(60*'Main Data Entry'!$D$22-'Main Data Entry'!$D$23))*(-1)*'Main Data Entry'!$G$21,IF($C143<(60-'Main Data Entry'!$D$23),(($C143-60+'Main Data Entry'!$D$23)/(60*'Main Data Entry'!$D$22-'Main Data Entry'!$D$23))*(-1)*'Main Data Entry'!$G$21,0))","v":0},0,59.963999999999999,null,null,null,null,null,null,null,null,43658.031666666728,null,null,59.945083618164063,453.3482666015625]
["T+23s",43658.031678240804,59.945426940917969,453.3482666015625,59.950757460160688,454.29945697206438,null,null,59.950757460160688,null,454.29945697206438,454.52117511171281,448.19947509765626,null,null,{"$f":"'Main Data Entry'!$G$21","v":0},{"$f":"IF($C144>(60+'Main Data Entry'!$D$23),(($C144-60-'Main Data Entry'!$D$23)/(60*'Main Data Entry'!$D$22-'Main Data Entry'!$D$23))*(-1)*'Main Data Entry'!$G$21,IF($C144<(60-'Main Data Entry'!$D$23),(($C144-60+'Main Data Entry'!$D$23)/(60*'Main Data Entry'!$D$22-'Main Data Entry'!$D$23))*(-1)*'Main Data Entry'!$G$21,0))","v":0},0,59.963999999999999,null,null,null,null,null,null,null,null,43658.031678240804,59.945426940917969,453.3482666015625,59.945426940917969,453.3482666015625]
["T+24s",43658.031689814881,{"$f":"OFFSET($AE145,-$B$1,0)","v":59.945426940917969},{"$f":"OFFSET($AF145,-$B$1,0)","v":453.3482666015625},59.950757460160688,454.29945697206438,null,null,59.950757460160688,null,454.29945697206438,454.52117511171281,448.19947509765626,null,null,{"$f":"'Main Data Entry'!$G$21","v":0},{"$f":"IF($C145>(60+'Main Data Entry'!$D$23),(($C145-60-'Main Data Entry'!$D$23)/(60*'Main Data Entry'!$D$22-'Main Data Entry'!$D$23))*(-1)*'Main Data Entry'!$G$21,IF($C145<(60-'Main Data Entry'!$D$23),(($C145-60+'Main Data Entry'!$D$23)/(60*'Main Data Entry'!$D$22-'Main Data Entry'!$D$23))*(-1)*'Main Data Entry'!$G$21,0))","v":0},0,{"$f":"Grid_Nominal_Frequency-Expected_Deadband_Setting","v":59.963999999999999},null,null,null,null,null,null,null,null,43658.031689814881,null,null,59.945426940917969,453.3482666015625]
["T+25s",43658.031701388958,59.945770263671875,454.10043334960938,59.950757460160688,454.29945697206438,null,null,59.950757460160688,null,454.29945697206438,454.52117511171281,448.19947509765626,null,null,{"$f":"'Main Data Entry'!$G$21","v":0},{"$f":"IF($C146>(60+'Main Data Entry'!$D$23),(($C146-60-'Main Data Entry'!$D$23)/(60*'Main Data Entry'!$D$22-'Main Data Entry'!$D$23))*(-1)*'Main Data Entry'!$G$21,IF($C146<(60-'Main Data Entry'!$D$23),(($C146-60+'Main Data Entry'!$D$23)/(60*'Main Data Entry'!$D$22-'Main Data Entry'!$D$23))*(-1)*'Main Data Entry'!$G$21,0))","v":0},0,59.963999999999999,null,null,null,null,null,null,null,null,43658.031701388958,59.945770263671875,454.10043334960938,59.945770263671875,454.10043334960938]
["T+26s",43658.031712963035,59.945770263671875,454.10043334960938,59.950757460160688,454.29945697206438,null,null,59.950757460160688,null,454.29945697206438,454.52117511171281,448.19947509765626,null,null,{"$f":"'Main Data Entry'!$G$21","v":0},{"$f":"IF($C147>(60+'Main Data Entry'!$D$23),(($C147-60-'Main Data Entry'!$D$23)/(60*'Main Data Entry'!$D$22-'Main Data Entry'!$D$23))*(-1)*'Main Data Entry'!$G$21,IF($C147<(60-'Main Data Entry'!$D$23),(($C147-60+'Main Data Entry'!$D$23)/(60*'Main Data Entry'!$D$22-'Main Data Entry'!$D$23))*(-1)*'Main Data Entry'!$G$21,0))","v":0},0,59.963999999999999,null,null,null,null,null,null,null,null,43658.031712963035,null,null,59.945770263671875,454.10043334960938]
["T+27s",43658.031724537112,59.946117401123047,454.85299682617188,59.950757460160688,454.29945697206438,null,null,59.950757460160688,null,454.29945697206438,454.52117511171281,448.19947509765626,null,null,{"$f":"'Main Data Entry'!$G$21","v":0},{"$f":"IF($C148>(60+'Main Data Entry'!$D$23),(($C148-60-'Main Data Entry'!$D$23)/(60*'Main Data Entry'!$D$22-'Main Data Entry'!$D$23))*(-1)*'Main Data Entry'!$G$21,IF($C148<(60-'Main Data Entry'!$D$23),(($C148-60+'Main Data Entry'!$D$23)/(60*'Main Data Entry'!$D$22-'Main Data Entry'!$D$23))*(-1)*'Main Data Entry'!$G$21,0))","v":0},0,59.963999999999999,null,null,null,null,null,null,null,null,43658.031724537112,59.946117401123047,454.85299682617188,59.946117401123047,454.85299682617188]
["T+28s",43658.031736111188,59.946117401123047,454.85299682617188,59.950757460160688,454.29945697206438,null,null,59.950757460160688,null,454.29945697206438,454.52117511171281,448.19947509765626,null,null,{"$f":"'Main Data Entry'!$G$21","v":0},{"$f":"IF($C149>(60+'Main Data Entry'!$D$23),(($C149-60-'Main Data Entry'!$D$23)/(60*'Main Data Entry'!$D$22-'Main Data Entry'!$D$23))*(-1)*'Main Data Entry'!$G$21,IF($C149<(60-'Main Data Entry'!$D$23),(($C149-60+'Main Data Entry'!$D$23)/(60*'Main Data Entry'!$D$22-'Main Data Entry'!$D$23))*(-1)*'Main Data Entry'!$G$21,0))","v":0},0,59.963999999999999,null,null,null,null,null,null,null,null,43658.031736111188,null,null,59.946117401123047,454.85299682617188]
["T+29s",43658.031747685265,59.946460723876953,454.85299682617188,59.950757460160688,454.29945697206438,null,null,59.950757460160688,null,454.29945697206438,454.52117511171281,448.19947509765626,null,null,{"$f":"'Main Data Entry'!$G$21","v":0},{"$f":"IF($C150>(60+'Main Data Entry'!$D$23),(($C150-60-'Main Data Entry'!$D$23)/(60*'Main Data Entry'!$D$22-'Main Data Entry'!$D$23))*(-1)*'Main Data Entry'!$G$21,IF($C150<(60-'Main Data Entry'!$D$23),(($C150-60+'Main Data Entry'!$D$23)/(60*'Main Data Entry'!$D$22-'Main Data Entry'!$D$23))*(-1)*'Main Data Entry'!$G$21,0))","v":0},0,59.963999999999999,null,null,null,null,null,null,null,null,43658.031747685265,59.946460723876953,454.85299682617188,59.946460723876953,454.85299682617188]
["T+30s",43658.031759259342,59.946460723876953,454.85299682617188,59.950757460160688,454.29945697206438,null,null,59.950757460160688,null,454.29945697206438,454.52117511171281,448.19947509765626,null,null,{"$f":"'Main Data Entry'!$G$21","v":0},{"$f":"IF($C151>(60+'Main Data Entry'!$D$23),(($C151-60-'Main Data Entry'!$D$23)/(60*'Main Data Entry'!$D$22-'Main Data Entry'!$D$23))*(-1)*'Main Data Entry'!$G$21,IF($C151<(60-'Main Data Entry'!$D$23),(($C151-60+'Main Data Entry'!$D$23)/(60*'Main Data Entry'!$D$22-'Main Data Entry'!$D$23))*(-1)*'Main Data Entry'!$G$21,0))","v":0},0,59.963999999999999,null,null,null,null,null,null,null,null,43658.031759259342,null,null,59.946460723876953,454.85299682617188]
["T+31s",43658.031770833419,59.946807861328125,455.18133544921875,59.950757460160688,454.29945697206438,null,null,59.950757460160688,null,454.29945697206438,454.52117511171281,448.19947509765626,null,null,{"$f":"'Main Data Entry'!$G$21","v":0},{"$f":"IF($C152>(60+'Main Data Entry'!$D$23),(($C152-60-'Main Data Entry'!$D$23)/(60*'Main Data Entry'!$D$22-'Main Data Entry'!$D$23))*(-1)*'Main Data Entry'!$G$21,IF($C152<(60-'Main Data Entry'!$D$23),(($C152-60+'Main Data Entry'!$D$23)/(60*'Main Data Entry'!$D$22-'Main Data Entry'!$D$23))*(-1)*'Main Data Entry'!$G$21,0))","v":0},0,59.963999999999999,null,null,null,null,null,null,null,null,43658.031770833419,59.946807861328125,455.18133544921875,59.946807861328125,455.18133544921875]
["T+32s",43658.031782407495,59.946807861328125,455.18133544921875,59.950757460160688,454.29945697206438,null,null,59.950757460160688,null,454.29945697206438,454.52117511171281,448.19947509765626,null,null,{"$f":"'Main Data Entry'!$G$21","v":0},{"$f":"IF($C153>(60+'Main Data Entry'!$D$23),(($C153-60-'Main Data Entry'!$D$23)/(60*'Main Data Entry'!$D$22-'Main Data Entry'!$D$23))*(-1)*'Main Data Entry'!$G$21,IF($C153<(60-'Main Data Entry'!$D$23),(($C153-60+'Main Data Entry'!$D$23)/(60*'Main Data Entry'!$D$22-'Main Data Entry'!$D$23))*(-1)*'Main Data Entry'!$G$21,0))","v":0},0,59.963999999999999,null,null,null,null,null,null,null,null,43658.031782407495,null,null,59.946807861328125,455.18133544921875]
["T+33s",43658.031793981572,59.947151184082031,455.1824951171875,59.950757460160688,454.29945697206438,null,null,59.950757460160688,null,454.29945697206438,454.52117511171281,448.19947509765626,null,null,{"$f":"'Main Data Entry'!$G$21","v":0},{"$f":"IF($C154>(60+'Main Data Entry'!$D$23),(($C154-60-'Main Data Entry'!$D$23)/(60*'Main Data Entry'!$D$22-'Main Data Entry'!$D$23))*(-1)*'Main Data Entry'!$G$21,IF($C154<(60-'Main Data Entry'!$D$23),(($C154-60+'Main Data Entry'!$D$23)/(60*'Main Data Entry'!$D$22-'Main Data Entry'!$D$23))*(-1)*'Main Data Entry'!$G$21,0))","v":0},0,59.963999999999999,null,null,null,null,null,null,null,null,{"$f":"AB153+TIME(0,0,1)","v":43658.031793981572},59.947151184082031,455.1824951171875,59.947151184082031,455.1824951171875]
["T+34s",43658.031805555649,59.947151184082031,455.1824951171875,59.950757460160688,454.29945697206438,null,null,59.950757460160688,null,454.29945697206438,454.52117511171281,448.19947509765626,null,null,{"$f":"'Main Data Entry'!$G$21","v":0},{"$f":"IF($C155>(60+'Main Data Entry'!$D$23),(($C155-60-'Main Data Entry'!$D$23)/(60*'Main Data Entry'!$D$22-'Main Data Entry'!$D$23))*(-1)*'Main Data Entry'!$G$21,IF($C155<(60-'Main Data Entry'!$D$23),(($C155-60+'Main Data Entry'!$D$23)/(60*'Main Data Entry'!$D$22-'Main Data Entry'!$D$23))*(-1)*'Main Data Entry'!$G$21,0))","v":0},0,59.963999999999999,null,null,null,null,null,null,null,null,43658.031805555649,null,null,59.947151184082031,455.1824951171875]
["T+35s",43658.031817129726,59.947498321533203,455.1824951171875,59.950757460160688,454.29945697206438,null,null,59.950757460160688,null,454.29945697206438,454.52117511171281,448.19947509765626,null,null,{"$f":"'Main Data Entry'!$G$21","v":0},{"$f":"IF($C156>(60+'Main Data Entry'!$D$23),(($C156-60-'Main Data Entry'!$D$23)/(60*'Main Data Entry'!$D$22-'Main Data Entry'!$D$23))*(-1)*'Main Data Entry'!$G$21,IF($C156<(60-'Main Data Entry'!$D$23),(($C156-60+'Main Data Entry'!$D$23)/(60*'Main Data Entry'!$D$22-'Main Data Entry'!$D$23))*(-1)*'Main Data Entry'!$G$21,0))","v":0},0,59.963999999999999,null,null,null,null,null,null,null,null,43658.031817129726,59.947498321533203,455.1824951171875,59.947498321533203,455.1824951171875]
["T+36s",43658.031828703803,59.947498321533203,455.1824951171875,59.950757460160688,454.29945697206438,null,null,59.950757460160688,null,454.29945697206438,454.52117511171281,448.19947509765626,null,null,{"$f":"'Main Data Entry'!$G$21","v":0},{"$f":"IF($C157>(60+'Main Data Entry'!$D$23),(($C157-60-'Main Data Entry'!$D$23)/(60*'Main Data Entry'!$D$22-'Main Data Entry'!$D$23))*(-1)*'Main Data Entry'!$G$21,IF($C157<(60-'Main Data Entry'!$D$23),(($C157-60+'Main Data Entry'!$D$23)/(60*'Main Data Entry'!$D$22-'Main Data Entry'!$D$23))*(-1)*'Main Data Entry'!$G$21,0))","v":0},0,59.963999999999999,null,null,null,null,null,null,null,null,43658.031828703803,null,null,59.947498321533203,455.1824951171875]
["T+37s",43658.031840277879,59.950313568115234,454.8201904296875,59.950757460160688,454.29945697206438,null,null,59.950757460160688,null,454.29945697206438,454.52117511171281,448.19947509765626,null,null,{"$f":"'Main Data Entry'!$G$21","v":0},{"$f":"IF($C158>(60+'Main Data Entry'!$D$23),(($C158-60-'Main Data Entry'!$D$23)/(60*'Main Data Entry'!$D$22-'Main Data Entry'!$D$23))*(-1)*'Main Data Entry'!$G$21,IF($C158<(60-'Main Data Entry'!$D$23),(($C158-60+'Main Data Entry'!$D$23)/(60*'Main Data Entry'!$D$22-'Main Data Entry'!$D$23))*(-1)*'Main Data Entry'!$G$21,0))","v":0},0,59.963999999999999,null,null,null,null,null,null,null,null,43658.031840277879,59.950313568115234,454.8201904296875,59.950313568115234,454.8201904296875]
["T+38s",43658.031851851956,59.950313568115234,454.8201904296875,59.950757460160688,454.29945697206438,null,null,59.950757460160688,null,454.29945697206438,454.52117511171281,448.19947509765626,null,null,{"$f":"'Main Data Entry'!$G$21","v":0},{"$f":"IF($C159>(60+'Main Data Entry'!$D$23),(($C159-60-'Main Data Entry'!$D$23)/(60*'Main Data Entry'!$D$22-'Main Data Entry'!$D$23))*(-1)*'Main Data Entry'!$G$21,IF($C159<(60-'Main Data Entry'!$D$23),(($C159-60+'Main Data Entry'!$D$23)/(60*'Main Data Entry'!$D$22-'Main Data Entry'!$D$23))*(-1)*'Main Data Entry'!$G$21,0))","v":0},0,59.963999999999999,null,null,null,null,null,null,null,null,43658.031851851956,null,null,59.950313568115234,454.8201904296875]
["T+39s",43658.031863426033,59.953128814697266,454.8626708984375,59.950757460160688,454.29945697206438,null,null,59.950757460160688,null,454.29945697206438,454.52117511171281,448.19947509765626,null,null,{"$f":"'Main Data Entry'!$G$21","v":0},{"$f":"IF($C160>(60+'Main Data Entry'!$D$23),(($C160-60-'Main Data Entry'!$D$23)/(60*'Main Data Entry'!$D$22-'Main Data Entry'!$D$23))*(-1)*'Main Data Entry'!$G$21,IF($C160<(60-'Main Data Entry'!$D$23),(($C160-60+'Main Data Entry'!$D$23)/(60*'Main Data Entry'!$D$22-'Main Data Entry'!$D$23))*(-1)*'Main Data Entry'!$G$21,0))","v":0},0,59.963999999999999,null,null,null,null,null,null,null,null,43658.031863426033,59.953128814697266,454.8626708984375,59.953128814697266,454.8626708984375]
["T+40s",43658.03187500011,59.953128814697266,454.8626708984375,59.950757460160688,454.29945697206438,null,null,59.950757460160688,null,454.29945697206438,454.52117511171281,448.19947509765626,null,null,{"$f":"'Main Data Entry'!$G$21","v":0},{"$f":"IF($C161>(60+'Main Data Entry'!$D$23),(($C161-60-'Main Data Entry'!$D$23)/(60*'Main Data Entry'!$D$22-'Main Data Entry'!$D$23))*(-1)*'Main Data Entry'!$G$21,IF($C161<(60-'Main Data Entry'!$D$23),(($C161-60+'Main Data Entry'!$D$23)/(60*'Main Data Entry'!$D$22-'Main Data Entry'!$D$23))*(-1)*'Main Data Entry'!$G$21,0))","v":0},0,59.963999999999999,null,null,null,null,null,null,null,null,43658.03187500011,null,null,59.953128814697266,454.8626708984375]
["T+41s",43658.031886574187,59.953132629394531,454.90658569335938,59.950757460160688,454.29945697206438,null,null,59.950757460160688,null,454.29945697206438,454.52117511171281,448.19947509765626,null,null,{"$f":"'Main Data Entry'!$G$21","v":0},{"$f":"IF($C162>(60+'Main Data Entry'!$D$23),(($C162-60-'Main Data Entry'!$D$23)/(60*'Main Data Entry'!$D$22-'Main Data Entry'!$D$23))*(-1)*'Main Data Entry'!$G$21,IF($C162<(60-'Main Data Entry'!$D$23),(($C162-60+'Main Data Entry'!$D$23)/(60*'Main Data Entry'!$D$22-'Main Data Entry'!$D$23))*(-1)*'Main Data Entry'!$G$21,0))","v":0},0,59.963999999999999,null,null,null,null,null,null,null,null,43658.031886574187,59.953132629394531,454.90658569335938,59.953132629394531,454.90658569335938]
["T+42s",43658.031898148263,59.953132629394531,454.90658569335938,59.950757460160688,454.29945697206438,null,null,59.950757460160688,null,454.29945697206438,454.52117511171281,448.19947509765626,null,null,{"$f":"'Main Data Entry'!$G$21","v":0},{"$f":"IF($C163>(60+'Main Data Entry'!$D$23),(($C163-60-'Main Data Entry'!$D$23)/(60*'Main Data Entry'!$D$22-'Main Data Entry'!$D$23))*(-1)*'Main Data Entry'!$G$21,IF($C163<(60-'Main Data Entry'!$D$23),(($C163-60+'Main Data Entry'!$D$23)/(60*'Main Data Entry'!$D$22-'Main Data Entry'!$D$23))*(-1)*'Main Data Entry'!$G$21,0))","v":0},0,59.963999999999999,null,null,null,null,null,null,null,null,43658.031898148263,null,null,59.953132629394531,454.90658569335938]
["T+43s",43658.03190972234,59.953132629394531,454.95046997070313,59.950757460160688,454.29945697206438,null,null,59.950757460160688,null,454.29945697206438,454.52117511171281,448.19947509765626,null,null,{"$f":"'Main Data Entry'!$G$21","v":0},{"$f":"IF($C164>(60+'Main Data Entry'!$D$23),(($C164-60-'Main Data Entry'!$D$23)/(60*'Main Data Entry'!$D$22-'Main Data Entry'!$D$23))*(-1)*'Main Data Entry'!$G$21,IF($C164<(60-'Main Data Entry'!$D$23),(($C164-60+'Main Data Entry'!$D$23)/(60*'Main Data Entry'!$D$22-'Main Data Entry'!$D$23))*(-1)*'Main Data Entry'!$G$21,0))","v":0},0,59.963999999999999,null,null,null,null,null,null,null,null,43658.03190972234,59.953132629394531,454.95046997070313,59.953132629394531,454.95046997070313]
["T+44s",43658.031921296417,59.953132629394531,454.95046997070313,59.950757460160688,454.29945697206438,null,null,59.950757460160688,null,454.29945697206438,454.52117511171281,448.19947509765626,null,null,{"$f":"'Main Data Entry'!$G$21","v":0},{"$f":"IF($C165>(60+'Main Data Entry'!$D$23),(($C165-60-'Main Data Entry'!$D$23)/(60*'Main Data Entry'!$D$22-'Main Data Entry'!$D$23))*(-1)*'Main Data Entry'!$G$21,IF($C165<(60-'Main Data Entry'!$D$23),(($C165-60+'Main Data Entry'!$D$23)/(60*'Main Data Entry'!$D$22-'Main Data Entry'!$D$23))*(-1)*'Main Data Entry'!$G$21,0))","v":0},0,59.963999999999999,null,null,null,null,null,null,null,null,43658.031921296417,null,null,59.953132629394531,454.95046997070313]
["T+45s",43658.031932870494,59.956798553466797,454.02902221679688,59.950757460160688,454.29945697206438,null,null,59.950757460160688,null,454.29945697206438,454.52117511171281,448.19947509765626,null,null,{"$f":"'Main Data Entry'!$G$21","v":0},{"$f":"IF($C166>(60+'Main Data Entry'!$D$23),(($C166-60-'Main Data Entry'!$D$23)/(60*'Main Data Entry'!$D$22-'Main Data Entry'!$D$23))*(-1)*'Main Data Entry'!$G$21,IF($C166<(60-'Main Data Entry'!$D$23),(($C166-60+'Main Data Entry'!$D$23)/(60*'Main Data Entry'!$D$22-'Main Data Entry'!$D$23))*(-1)*'Main Data Entry'!$G$21,0))","v":0},0,59.963999999999999,null,null,null,null,null,null,null,null,43658.031932870494,59.956798553466797,454.02902221679688,59.956798553466797,454.02902221679688]
["T+46s",43658.03194444457,59.956798553466797,454.02902221679688,59.950757460160688,454.29945697206438,null,null,59.950757460160688,null,454.29945697206438,454.52117511171281,448.19947509765626,{"$f":"P$12+P$26","v":454.02902221679688},{"$f":"P$12+P$31","v":448.19947509765626},{"$f":"'Main Data Entry'!$G$21","v":0},{"$f":"IF($C167>(60+'Main Data Entry'!$D$23),(($C167-60-'Main Data Entry'!$D$23)/(60*'Main Data Entry'!$D$22-'Main Data Entry'!$D$23))*(-1)*'Main Data Entry'!$G$21,IF($C167<(60-'Main Data Entry'!$D$23),(($C167-60+'Main Data Entry'!$D$23)/(60*'Main Data Entry'!$D$22-'Main Data Entry'!$D$23))*(-1)*'Main Data Entry'!$G$21,0))","v":0},0,59.963999999999999,null,null,null,null,null,null,null,null,43658.03194444457,null,null,59.956798553466797,454.02902221679688]
["T+47s",43658.031956018647,59.960468292236328,453.10708618164063,59.950757460160688,454.29945697206438,null,null,59.950757460160688,null,454.29945697206438,454.52117511171281,448.19947509765626,{"$f":"P$12+P$26","v":454.02902221679688},{"$f":"P$12+P$31","v":448.19947509765626},{"$f":"'Main Data Entry'!$G$21","v":0},{"$f":"IF($C168>(60+'Main Data Entry'!$D$23),(($C168-60-'Main Data Entry'!$D$23)/(60*'Main Data Entry'!$D$22-'Main Data Entry'!$D$23))*(-1)*'Main Data Entry'!$G$21,IF($C168<(60-'Main Data Entry'!$D$23),(($C168-60+'Main Data Entry'!$D$23)/(60*'Main Data Entry'!$D$22-'Main Data Entry'!$D$23))*(-1)*'Main Data Entry'!$G$21,0))","v":0},0,59.963999999999999,null,null,null,null,null,null,null,null,43658.031956018647,59.960468292236328,453.10708618164063,59.960468292236328,453.10708618164063]
["T+48s",43658.031967592724,59.960468292236328,453.10708618164063,59.950757460160688,454.29945697206438,null,null,59.950757460160688,null,454.29945697206438,454.52117511171281,448.19947509765626,454.02902221679688,448.19947509765626,{"$f":"'Main Data Entry'!$G$21","v":0},{"$f":"IF($C169>(60+'Main Data Entry'!$D$23),(($C169-60-'Main Data Entry'!$D$23)/(60*'Main Data Entry'!$D$22-'Main Data Entry'!$D$23))*(-1)*'Main Data Entry'!$G$21,IF($C169<(60-'Main Data Entry'!$D$23),(($C169-60+'Main Data Entry'!$D$23)/(60*'Main Data Entry'!$D$22-'Main Data Entry'!$D$23))*(-1)*'Main Data Entry'!$G$21,0))","v":0},0,59.963999999999999,null,null,null,null,null,null,null,null,43658.031967592724,null,null,59.960468292236328,453.10708618164063]
["T+49s",43658.031979166801,59.960479736328125,453.10430908203125,59.950757460160688,454.29945697206438,null,null,59.950757460160688,null,454.29945697206438,454.52117511171281,448.19947509765626,454.02902221679688,448.19947509765626,{"$f":"'Main Data Entry'!$G$21","v":0},{"$f":"IF($C170>(60+'Main Data Entry'!$D$23),(($C170-60-'Main Data Entry'!$D$23)/(60*'Main Data Entry'!$D$22-'Main Data Entry'!$D$23))*(-1)*'Main Data Entry'!$G$21,IF($C170<(60-'Main Data Entry'!$D$23),(($C170-60+'Main Data Entry'!$D$23)/(60*'Main Data Entry'!$D$22-'Main Data Entry'!$D$23))*(-1)*'Main Data Entry'!$G$21,0))","v":0},0,59.963999999999999,null,null,null,null,null,null,null,null,{"$f":"AB169+TIME(0,0,1)","v":43658.031979166801},59.960479736328125,453.10430908203125,59.960479736328125,453.10430908203125]
["T+50s",43658.031990740878,59.960479736328125,453.10430908203125,59.950757460160688,454.29945697206438,null,null,59.950757460160688,null,454.29945697206438,454.52117511171281,448.19947509765626,454.02902221679688,448.19947509765626,{"$f":"'Main Data Entry'!$G$21","v":0},{"$f":"IF($C171>(60+'Main Data Entry'!$D$23),(($C171-60-'Main Data Entry'!$D$23)/(60*'Main Data Entry'!$D$22-'Main Data Entry'!$D$23))*(-1)*'Main Data Entry'!$G$21,IF($C171<(60-'Main Data Entry'!$D$23),(($C171-60+'Main Data Entry'!$D$23)/(60*'Main Data Entry'!$D$22-'Main Data Entry'!$D$23))*(-1)*'Main Data Entry'!$G$21,0))","v":0},0,59.963999999999999,null,null,null,null,null,null,null,null,43658.031990740878,null,null,59.960479736328125,453.10430908203125]
["T+51s",43658.032002314954,59.957359313964844,453.43728637695313,59.950757460160688,454.29945697206438,null,null,59.950757460160688,null,454.29945697206438,454.52117511171281,448.19947509765626,454.02902221679688,448.19947509765626,{"$f":"'Main Data Entry'!$G$21","v":0},{"$f":"IF($C172>(60+'Main Data Entry'!$D$23),(($C172-60-'Main Data Entry'!$D$23)/(60*'Main Data Entry'!$D$22-'Main Data Entry'!$D$23))*(-1)*'Main Data Entry'!$G$21,IF($C172<(60-'Main Data Entry'!$D$23),(($C172-60+'Main Data Entry'!$D$23)/(60*'Main Data Entry'!$D$22-'Main Data Entry'!$D$23))*(-1)*'Main Data Entry'!$G$21,0))","v":0},0,59.963999999999999,null,null,null,null,null,null,null,null,43658.032002314954,59.957359313964844,453.43728637695313,59.957359313964844,453.43728637695313]
["T+52s",43658.032013889031,59.957359313964844,453.43728637695313,59.950757460160688,454.29945697206438,null,null,59.950757460160688,null,454.29945697206438,454.52117511171281,448.19947509765626,454.02902221679688,448.19947509765626,{"$f":"'Main Data Entry'!$G$21","v":0},{"$f":"IF($C173>(60+'Main Data Entry'!$D$23),(($C173-60-'Main Data Entry'!$D$23)/(60*'Main Data Entry'!$D$22-'Main Data Entry'!$D$23))*(-1)*'Main Data Entry'!$G$21,IF($C173<(60-'Main Data Entry'!$D$23),(($C173-60+'Main Data Entry'!$D$23)/(60*'Main Data Entry'!$D$22-'Main Data Entry'!$D$23))*(-1)*'Main Data Entry'!$G$21,0))","v":0},0,59.963999999999999,null,null,null,null,null,null,null,null,43658.032013889031,null,null,59.957359313964844,453.43728637695313]
["T+53s",43658.032025463108,59.957351684570313,453.41629028320313,null,null,null,null,null,null,null,null,null,454.02902221679688,448.19947509765626,{"$f":"'Main Data Entry'!$G$21","v":0},{"$f":"IF($C174>(60+'Main Data Entry'!$D$23),(($C174-60-'Main Data Entry'!$D$23)/(60*'Main Data Entry'!$D$22-'Main Data Entry'!$D$23))*(-1)*'Main Data Entry'!$G$21,IF($C174<(60-'Main Data Entry'!$D$23),(($C174-60+'Main Data Entry'!$D$23)/(60*'Main Data Entry'!$D$22-'Main Data Entry'!$D$23))*(-1)*'Main Data Entry'!$G$21,0))","v":0},null,59.963999999999999,null,null,null,null,null,null,null,null,43658.032025463108,59.957351684570313,453.41629028320313,59.957351684570313,453.41629028320313]
["T+54s",43658.032037037185,59.957351684570313,453.41629028320313,null,null,null,null,null,null,null,null,null,454.02902221679688,448.19947509765626,{"$f":"'Main Data Entry'!$G$21","v":0},{"$f":"IF($C175>(60+'Main Data Entry'!$D$23),(($C175-60-'Main Data Entry'!$D$23)/(60*'Main Data Entry'!$D$22-'Main Data Entry'!$D$23))*(-1)*'Main Data Entry'!$G$21,IF($C175<(60-'Main Data Entry'!$D$23),(($C175-60+'Main Data Entry'!$D$23)/(60*'Main Data Entry'!$D$22-'Main Data Entry'!$D$23))*(-1)*'Main Data Entry'!$G$21,0))","v":0},null,59.963999999999999,null,null,null,null,null,null,null,null,43658.032037037185,null,null,59.957351684570313,453.41629028320313]
["T+55s",43658.032048611261,59.957351684570313,453.39419555664063,null,null,null,null,null,null,null,null,null,454.02902221679688,448.19947509765626,{"$f":"'Main Data Entry'!$G$21","v":0},{"$f":"IF($C176>(60+'Main Data Entry'!$D$23),(($C176-60-'Main Data Entry'!$D$23)/(60*'Main Data Entry'!$D$22-'Main Data Entry'!$D$23))*(-1)*'Main Data Entry'!$G$21,IF($C176<(60-'Main Data Entry'!$D$23),(($C176-60+'Main Data Entry'!$D$23)/(60*'Main Data Entry'!$D$22-'Main Data Entry'!$D$23))*(-1)*'Main Data Entry'!$G$21,0))","v":0},null,59.963999999999999,null,null,null,null,null,null,null,null,43658.032048611261,59.957351684570313,453.39419555664063,59.957351684570313,453.39419555664063]
["T+56s",43658.032060185338,{"$f":"OFFSET($AE177,-$B$1,0)","v":59.957351684570313},{"$f":"OFFSET($AF177,-$B$1,0)","v":453.39419555664063},null,null,null,null,null,null,null,null,null,454.02902221679688,448.19947509765626,{"$f":"'Main Data Entry'!$G$21","v":0},{"$f":"IF($C177>(60+'Main Data Entry'!$D$23),(($C177-60-'Main Data Entry'!$D$23)/(60*'Main Data Entry'!$D$22-'Main Data Entry'!$D$23))*(-1)*'Main Data Entry'!$G$21,IF($C177<(60-'Main Data Entry'!$D$23),(($C177-60+'Main Data Entry'!$D$23)/(60*'Main Data Entry'!$D$22-'Main Data Entry'!$D$23))*(-1)*'Main Data Entry'!$G$21,0))","v":0},null,{"$f":"Grid_Nominal_Frequency-Expected_Deadband_Setting","v":59.963999999999999},null,null,null,null,null,null,null,null,43658.032060185338,null,null,59.957351684570313,453.39419555664063]
["T+57s",43658.032071759415,59.958869934082031,453.37210083007813,null,null,null,null,null,null,null,null,null,454.02902221679688,448.19947509765626,{"$f":"'Main Data Entry'!$G$21","v":0},{"$f":"IF($C178>(60+'Main Data Entry'!$D$23),(($C178-60-'Main Data Entry'!$D$23)/(60*'Main Data Entry'!$D$22-'Main Data Entry'!$D$23))*(-1)*'Main Data Entry'!$G$21,IF($C178<(60-'Main Data Entry'!$D$23),(($C178-60+'Main Data Entry'!$D$23)/(60*'Main Data Entry'!$D$22-'Main Data Entry'!$D$23))*(-1)*'Main Data Entry'!$G$21,0))","v":0},null,59.963999999999999,null,null,null,null,null,null,null,null,43658.032071759415,59.958869934082031,453.37210083007813,59.958869934082031,453.37210083007813]
["T+58s",43658.032083333492,59.958869934082031,453.37210083007813,null,null,null,null,null,null,null,null,null,454.02902221679688,448.19947509765626,{"$f":"'Main Data Entry'!$G$21","v":0},{"$f":"IF($C179>(60+'Main Data Entry'!$D$23),(($C179-60-'Main Data Entry'!$D$23)/(60*'Main Data Entry'!$D$22-'Main Data Entry'!$D$23))*(-1)*'Main Data Entry'!$G$21,IF($C179<(60-'Main Data Entry'!$D$23),(($C179-60+'Main Data Entry'!$D$23)/(60*'Main Data Entry'!$D$22-'Main Data Entry'!$D$23))*(-1)*'Main Data Entry'!$G$21,0))","v":0},null,59.963999999999999,null,null,null,null,null,null,null,null,43658.032083333492,null,null,59.958869934082031,453.37210083007813]
["T+59s",43658.032094907569,59.958950042724609,453.35003662109375,null,null,null,null,null,null,null,null,null,454.02902221679688,448.19947509765626,{"$f":"'Main Data Entry'!$G$21","v":0},{"$f":"IF($C180>(60+'Main Data Entry'!$D$23),(($C180-60-'Main Data Entry'!$D$23)/(60*'Main Data Entry'!$D$22-'Main Data Entry'!$D$23))*(-1)*'Main Data Entry'!$G$21,IF($C180<(60-'Main Data Entry'!$D$23),(($C180-60+'Main Data Entry'!$D$23)/(60*'Main Data Entry'!$D$22-'Main Data Entry'!$D$23))*(-1)*'Main Data Entry'!$G$21,0))","v":0},null,59.963999999999999,null,null,null,null,null,null,null,null,43658.032094907569,59.958950042724609,453.35003662109375,59.958950042724609,453.35003662109375]
["T+60s",43658.032106481645,59.958950042724609,453.35003662109375,null,null,null,null,null,null,null,null,null,454.02902221679688,448.19947509765626,{"$f":"'Main Data Entry'!$G$21","v":0},{"$f":"IF($C181>(60+'Main Data Entry'!$D$23),(($C181-60-'Main Data Entry'!$D$23)/(60*'Main Data Entry'!$D$22-'Main Data Entry'!$D$23))*(-1)*'Main Data Entry'!$G$21,IF($C181<(60-'Main Data Entry'!$D$23),(($C181-60+'Main Data Entry'!$D$23)/(60*'Main Data Entry'!$D$22-'Main Data Entry'!$D$23))*(-1)*'Main Data Entry'!$G$21,0))","v":0},null,59.963999999999999,null,null,null,null,null,null,null,null,43658.032106481645,null,null,59.958950042724609,453.35003662109375]
["T+61s",43658.032118055722,59.959026336669922,453.32675170898438,null,null,null,null,null,null,null,null,null,null,null,{"$f":"'Main Data Entry'!$G$21","v":0},{"$f":"IF($C182>(60+'Main Data Entry'!$D$23),(($C182-60-'Main Data Entry'!$D$23)/(60*'Main Data Entry'!$D$22-'Main Data Entry'!$D$23))*(-1)*'Main Data Entry'!$G$21,IF($C182<(60-'Main Data Entry'!$D$23),(($C182-60+'Main Data Entry'!$D$23)/(60*'Main Data Entry'!$D$22-'Main Data Entry'!$D$23))*(-1)*'Main Data Entry'!$G$21,0))","v":0},null,59.963999999999999,null,null,null,null,null,null,null,null,43658.032118055722,59.959026336669922,453.32675170898438,59.959026336669922,453.32675170898438]
["T+62s",43658.032129629799,59.959026336669922,453.32675170898438,null,null,null,null,null,null,null,null,null,null,null,{"$f":"'Main Data Entry'!$G$21","v":0},{"$f":"IF($C183>(60+'Main Data Entry'!$D$23),(($C183-60-'Main Data Entry'!$D$23)/(60*'Main Data Entry'!$D$22-'Main Data Entry'!$D$23))*(-1)*'Main Data Entry'!$G$21,IF($C183<(60-'Main Data Entry'!$D$23),(($C183-60+'Main Data Entry'!$D$23)/(60*'Main Data Entry'!$D$22-'Main Data Entry'!$D$23))*(-1)*'Main Data Entry'!$G$21,0))","v":0},null,59.963999999999999,null,null,null,null,null,null,null,null,43658.032129629799,null,null,59.959026336669922,453.32675170898438]
["T+63s",43658.032141203876,59.9591064453125,452.82525634765625,null,null,null,null,null,null,null,null,null,null,null,{"$f":"'Main Data Entry'!$G$21","v":0},{"$f":"IF($C184>(60+'Main Data Entry'!$D$23),(($C184-60-'Main Data Entry'!$D$23)/(60*'Main Data Entry'!$D$22-'Main Data Entry'!$D$23))*(-1)*'Main Data Entry'!$G$21,IF($C184<(60-'Main Data Entry'!$D$23),(($C184-60+'Main Data Entry'!$D$23)/(60*'Main Data Entry'!$D$22-'Main Data Entry'!$D$23))*(-1)*'Main Data Entry'!$G$21,0))","v":0},null,59.963999999999999,null,null,null,null,null,null,null,null,43658.032141203876,59.9591064453125,452.82525634765625,59.9591064453125,452.82525634765625]
["T+64s",43658.032152777952,59.9591064453125,452.82525634765625,null,null,null,null,null,null,null,null,null,null,null,{"$f":"'Main Data Entry'!$G$21","v":0},{"$f":"IF($C185>(60+'Main Data Entry'!$D$23),(($C185-60-'Main Data Entry'!$D$23)/(60*'Main Data Entry'!$D$22-'Main Data Entry'!$D$23))*(-1)*'Main Data Entry'!$G$21,IF($C185<(60-'Main Data Entry'!$D$23),(($C185-60+'Main Data Entry'!$D$23)/(60*'Main Data Entry'!$D$22-'Main Data Entry'!$D$23))*(-1)*'Main Data Entry'!$G$21,0))","v":0},null,59.963999999999999,null,null,null,null,null,null,null,null,43658.032152777952,null,null,59.9591064453125,452.82525634765625]
["T+65s",43658.032164352029,59.959182739257813,452.82376098632813,null,null,null,null,null,null,null,null,null,null,null,{"$f":"'Main Data Entry'!$G$21","v":0},{"$f":"IF($C186>(60+'Main Data Entry'!$D$23),(($C186-60-'Main Data Entry'!$D$23)/(60*'Main Data Entry'!$D$22-'Main Data Entry'!$D$23))*(-1)*'Main Data Entry'!$G$21,IF($C186<(60-'Main Data Entry'!$D$23),(($C186-60+'Main Data Entry'!$D$23)/(60*'Main Data Entry'!$D$22-'Main Data Entry'!$D$23))*(-1)*'Main Data Entry'!$G$21,0))","v":0},null,59.963999999999999,null,null,null,null,null,null,null,null,{"$f":"AB185+TIME(0,0,1)","v":43658.032164352029},59.959182739257813,452.82376098632813,59.959182739257813,452.82376098632813]
["T+66s",{"$f":"B186+TIME(0,0,1)","v":43658.032175926106},59.959182739257813,452.82376098632813,null,null,null,null,null,null,null,null,null,null,null,{"$f":"'Main Data Entry'!$G$21","v":0},{"$f":"IF($C187>(60+'Main Data Entry'!$D$23),(($C187-60-'Main Data Entry'!$D$23)/(60*'Main Data Entry'!$D$22-'Main Data Entry'!$D$23))*(-1)*'Main Data Entry'!$G$21,IF($C187<(60-'Main Data Entry'!$D$23),(($C187-60+'Main Data Entry'!$D$23)/(60*'Main Data Entry'!$D$22-'Main Data Entry'!$D$23))*(-1)*'Main Data Entry'!$G$21,0))","v":0},null,59.963999999999999,null,null,null,null,null,null,null,null,43658.032175926106,null,null,59.959182739257813,452.82376098632813]
["T+67s",43658.032187500183,59.958370208740234,453.44039916992188,null,null,null,null,null,null,null,null,null,null,null,{"$f":"'Main Data Entry'!$G$21","v":0},{"$f":"IF($C188>(60+'Main Data Entry'!$D$23),(($C188-60-'Main Data Entry'!$D$23)/(60*'Main Data Entry'!$D$22-'Main Data Entry'!$D$23))*(-1)*'Main Data Entry'!$G$21,IF($C188<(60-'Main Data Entry'!$D$23),(($C188-60+'Main Data Entry'!$D$23)/(60*'Main Data Entry'!$D$22-'Main Data Entry'!$D$23))*(-1)*'Main Data Entry'!$G$21,0))","v":0},null,59.963999999999999,null,null,null,null,null,null,null,null,43658.032187500183,59.958370208740234,453.44039916992188,59.958370208740234,453.44039916992188]
["T+68s",43658.03219907426,59.958370208740234,453.44039916992188,null,null,null,null,null,null,null,null,null,null,null,{"$f":"'Main Data Entry'!$G$21","v":0},{"$f":"IF($C189>(60+'Main Data Entry'!$D$23),(($C189-60-'Main Data Entry'!$D$23)/(60*'Main Data Entry'!$D$22-'Main Data Entry'!$D$23))*(-1)*'Main Data Entry'!$G$21,IF($C189<(60-'Main Data Entry'!$D$23),(($C189-60+'Main Data Entry'!$D$23)/(60*'Main Data Entry'!$D$22-'Main Data Entry'!$D$23))*(-1)*'Main Data Entry'!$G$21,0))","v":0},null,59.963999999999999,null,null,null,null,null,null,null,null,43658.03219907426,null,null,59.958370208740234,453.44039916992188]
["T+69s",43658.032210648336,59.957550048828125,453.4422607421875,null,null,null,null,null,null,null,null,null,null,null,{"$f":"'Main Data Entry'!$G$21","v":0},{"$f":"IF($C190>(60+'Main Data Entry'!$D$23),(($C190-60-'Main Data Entry'!$D$23)/(60*'Main Data Entry'!$D$22-'Main Data Entry'!$D$23))*(-1)*'Main Data Entry'!$G$21,IF($C190<(60-'Main Data Entry'!$D$23),(($C190-60+'Main Data Entry'!$D$23)/(60*'Main Data Entry'!$D$22-'Main Data Entry'!$D$23))*(-1)*'Main Data Entry'!$G$21,0))","v":0},null,59.963999999999999,null,null,null,null,null,null,null,null,43658.032210648336,59.957550048828125,453.4422607421875,59.957550048828125,453.4422607421875]
["T+70s",43658.032222222413,59.957550048828125,453.4422607421875,null,null,null,null,null,null,null,null,null,null,null,{"$f":"'Main Data Entry'!$G$21","v":0},{"$f":"IF($C191>(60+'Main Data Entry'!$D$23),(($C191-60-'Main Data Entry'!$D$23)/(60*'Main Data Entry'!$D$22-'Main Data Entry'!$D$23))*(-1)*'Main Data Entry'!$G$21,IF($C191<(60-'Main Data Entry'!$D$23),(($C191-60+'Main Data Entry'!$D$23)/(60*'Main Data Entry'!$D$22-'Main Data Entry'!$D$23))*(-1)*'Main Data Entry'!$G$21,0))","v":0},null,59.963999999999999,null,null,null,null,null,null,null,null,43658.032222222413,null,null,59.957550048828125,453.4422607421875]
["T+71s",43658.03223379649,59.958534240722656,453.03939819335938,null,null,null,null,null,null,null,null,null,null,null,{"$f":"'Main Data Entry'!$G$21","v":0},{"$f":"IF($C192>(60+'Main Data Entry'!$D$23),(($C192-60-'Main Data Entry'!$D$23)/(60*'Main Data Entry'!$D$22-'Main Data Entry'!$D$23))*(-1)*'Main Data Entry'!$G$21,IF($C192<(60-'Main Data Entry'!$D$23),(($C192-60+'Main Data Entry'!$D$23)/(60*'Main Data Entry'!$D$22-'Main Data Entry'!$D$23))*(-1)*'Main Data Entry'!$G$21,0))","v":0},null,59.963999999999999,null,null,null,null,null,null,null,null,43658.03223379649,59.958534240722656,453.03939819335938,59.958534240722656,453.03939819335938]
["T+72s",43658.032245370567,59.958534240722656,453.03939819335938,null,null,null,null,null,null,null,null,null,null,null,{"$f":"'Main Data Entry'!$G$21","v":0},{"$f":"IF($C193>(60+'Main Data Entry'!$D$23),(($C193-60-'Main Data Entry'!$D$23)/(60*'Main Data Entry'!$D$22-'Main Data Entry'!$D$23))*(-1)*'Main Data Entry'!$G$21,IF($C193<(60-'Main Data Entry'!$D$23),(($C193-60+'Main Data Entry'!$D$23)/(60*'Main Data Entry'!$D$22-'Main Data Entry'!$D$23))*(-1)*'Main Data Entry'!$G$21,0))","v":0},null,59.963999999999999,null,null,null,null,null,null,null,null,43658.032245370567,null,null,59.958534240722656,453.03939819335938]
["T+73s",43658.032256944643,59.959518432617188,453.03900146484375,null,null,null,null,null,null,null,null,null,null,null,{"$f":"'Main Data Entry'!$G$21","v":0},{"$f":"IF($C194>(60+'Main Data Entry'!$D$23),(($C194-60-'Main Data Entry'!$D$23)/(60*'Main Data Entry'!$D$22-'Main Data Entry'!$D$23))*(-1)*'Main Data Entry'!$G$21,IF($C194<(60-'Main Data Entry'!$D$23),(($C194-60+'Main Data Entry'!$D$23)/(60*'Main Data Entry'!$D$22-'Main Data Entry'!$D$23))*(-1)*'Main Data Entry'!$G$21,0))","v":0},null,59.963999999999999,null,null,null,null,null,null,null,null,43658.032256944643,59.959518432617188,453.03900146484375,59.959518432617188,453.03900146484375]
["T+74s",43658.03226851872,59.959518432617188,453.03900146484375,null,null,null,null,null,null,null,null,null,null,null,{"$f":"'Main Data Entry'!$G$21","v":0},{"$f":"IF($C195>(60+'Main Data Entry'!$D$23),(($C195-60-'Main Data Entry'!$D$23)/(60*'Main Data Entry'!$D$22-'Main Data Entry'!$D$23))*(-1)*'Main Data Entry'!$G$21,IF($C195<(60-'Main Data Entry'!$D$23),(($C195-60+'Main Data Entry'!$D$23)/(60*'Main Data Entry'!$D$22-'Main Data Entry'!$D$23))*(-1)*'Main Data Entry'!$G$21,0))","v":0},null,59.963999999999999,null,null,null,null,null,null,null,null,43658.03226851872,null,null,59.959518432617188,453.03900146484375]
["T+75s",43658.032280092797,59.956417083740234,453.71475219726563,null,null,null,null,null,null,null,null,null,null,null,{"$f":"'Main Data Entry'!$G$21","v":0},{"$f":"IF($C196>(60+'Main Data Entry'!$D$23),(($C196-60-'Main Data Entry'!$D$23)/(60*'Main Data Entry'!$D$22-'Main Data Entry'!$D$23))*(-1)*'Main Data Entry'!$G$21,IF($C196<(60-'Main Data Entry'!$D$23),(($C196-60+'Main Data Entry'!$D$23)/(60*'Main Data Entry'!$D$22-'Main Data Entry'!$D$23))*(-1)*'Main Data Entry'!$G$21,0))","v":0},null,59.963999999999999,null,null,null,null,null,null,null,null,43658.032280092797,59.956417083740234,453.71475219726563,59.956417083740234,453.71475219726563]
["T+76s",43658.032291666874,59.956417083740234,453.71475219726563,null,null,null,null,null,null,null,null,null,null,null,{"$f":"'Main Data Entry'!$G$21","v":0},{"$f":"IF($C197>(60+'Main Data Entry'!$D$23),(($C197-60-'Main Data Entry'!$D$23)/(60*'Main Data Entry'!$D$22-'Main Data Entry'!$D$23))*(-1)*'Main Data Entry'!$G$21,IF($C197<(60-'Main Data Entry'!$D$23),(($C197-60+'Main Data Entry'!$D$23)/(60*'Main Data Entry'!$D$22-'Main Data Entry'!$D$23))*(-1)*'Main Data Entry'!$G$21,0))","v":0},null,59.963999999999999,null,null,null,null,null,null,null,null,43658.032291666874,null,null,59.956417083740234,453.71475219726563]
["T+77s",43658.032303240951,59.956401824951172,453.71847534179688,null,null,null,null,null,null,null,null,null,null,null,{"$f":"'Main Data Entry'!$G$21","v":0},{"$f":"IF($C198>(60+'Main Data Entry'!$D$23),(($C198-60-'Main Data Entry'!$D$23)/(60*'Main Data Entry'!$D$22-'Main Data Entry'!$D$23))*(-1)*'Main Data Entry'!$G$21,IF($C198<(60-'Main Data Entry'!$D$23),(($C198-60+'Main Data Entry'!$D$23)/(60*'Main Data Entry'!$D$22-'Main Data Entry'!$D$23))*(-1)*'Main Data Entry'!$G$21,0))","v":0},null,59.963999999999999,null,null,null,null,null,null,null,null,43658.032303240951,59.956401824951172,453.71847534179688,59.956401824951172,453.71847534179688]
["T+78s",43658.032314815027,59.956401824951172,453.71847534179688,null,null,null,null,null,null,null,null,null,null,null,{"$f":"'Main Data Entry'!$G$21","v":0},{"$f":"IF($C199>(60+'Main Data Entry'!$D$23),(($C199-60-'Main Data Entry'!$D$23)/(60*'Main Data Entry'!$D$22-'Main Data Entry'!$D$23))*(-1)*'Main Data Entry'!$G$21,IF($C199<(60-'Main Data Entry'!$D$23),(($C199-60+'Main Data Entry'!$D$23)/(60*'Main Data Entry'!$D$22-'Main Data Entry'!$D$23))*(-1)*'Main Data Entry'!$G$21,0))","v":0},null,59.963999999999999,null,null,null,null,null,null,null,null,43658.032314815027,null,null,59.956401824951172,453.71847534179688]
["T+79s",43658.032326389104,59.959266662597656,453.15896606445313,null,null,null,null,null,null,null,null,null,null,null,{"$f":"'Main Data Entry'!$G$21","v":0},{"$f":"IF($C200>(60+'Main Data Entry'!$D$23),(($C200-60-'Main Data Entry'!$D$23)/(60*'Main Data Entry'!$D$22-'Main Data Entry'!$D$23))*(-1)*'Main Data Entry'!$G$21,IF($C200<(60-'Main Data Entry'!$D$23),(($C200-60+'Main Data Entry'!$D$23)/(60*'Main Data Entry'!$D$22-'Main Data Entry'!$D$23))*(-1)*'Main Data Entry'!$G$21,0))","v":0},null,59.963999999999999,null,null,null,null,null,null,null,null,43658.032326389104,59.959266662597656,453.15896606445313,59.959266662597656,453.15896606445313]
["T+80s",43658.032337963181,59.959266662597656,453.15896606445313,null,null,null,null,null,null,null,null,null,null,null,{"$f":"'Main Data Entry'!$G$21","v":0},{"$f":"IF($C201>(60+'Main Data Entry'!$D$23),(($C201-60-'Main Data Entry'!$D$23)/(60*'Main Data Entry'!$D$22-'Main Data Entry'!$D$23))*(-1)*'Main Data Entry'!$G$21,IF($C201<(60-'Main Data Entry'!$D$23),(($C201-60+'Main Data Entry'!$D$23)/(60*'Main Data Entry'!$D$22-'Main Data Entry'!$D$23))*(-1)*'Main Data Entry'!$G$21,0))","v":0},null,59.963999999999999,null,null,null,null,null,null,null,null,43658.032337963181,null,null,59.959266662597656,453.15896606445313]
["T+81s",43658.032349537258,59.959434509277344,453.15838623046875,null,null,null,null,null,null,null,null,null,null,null,{"$f":"'Main Data Entry'!$G$21","v":0},{"$f":"IF($C202>(60+'Main Data Entry'!$D$23),(($C202-60-'Main Data Entry'!$D$23)/(60*'Main Data Entry'!$D$22-'Main Data Entry'!$D$23))*(-1)*'Main Data Entry'!$G$21,IF($C202<(60-'Main Data Entry'!$D$23),(($C202-60+'Main Data Entry'!$D$23)/(60*'Main Data Entry'!$D$22-'Main Data Entry'!$D$23))*(-1)*'Main Data Entry'!$G$21,0))","v":0},null,59.963999999999999,null,null,null,null,null,null,null,null,{"$f":"AB201+TIME(0,0,1)","v":43658.032349537258},59.959434509277344,453.15838623046875,59.959434509277344,453.15838623046875]
["T+82s",43658.032361111334,59.959434509277344,453.15838623046875,null,null,null,null,null,null,null,null,null,null,null,{"$f":"'Main Data Entry'!$G$21","v":0},{"$f":"IF($C203>(60+'Main Data Entry'!$D$23),(($C203-60-'Main Data Entry'!$D$23)/(60*'Main Data Entry'!$D$22-'Main Data Entry'!$D$23))*(-1)*'Main Data Entry'!$G$21,IF($C203<(60-'Main Data Entry'!$D$23),(($C203-60+'Main Data Entry'!$D$23)/(60*'Main Data Entry'!$D$22-'Main Data Entry'!$D$23))*(-1)*'Main Data Entry'!$G$21,0))","v":0},null,59.963999999999999,null,null,null,null,null,null,null,null,43658.032361111334,null,null,59.959434509277344,453.15838623046875]
["T+83s",43658.032372685411,59.959602355957031,453.15838623046875,null,null,null,null,null,null,null,null,null,null,null,{"$f":"'Main Data Entry'!$G$21","v":0},{"$f":"IF($C204>(60+'Main Data Entry'!$D$23),(($C204-60-'Main Data Entry'!$D$23)/(60*'Main Data Entry'!$D$22-'Main Data Entry'!$D$23))*(-1)*'Main Data Entry'!$G$21,IF($C204<(60-'Main Data Entry'!$D$23),(($C204-60+'Main Data Entry'!$D$23)/(60*'Main Data Entry'!$D$22-'Main Data Entry'!$D$23))*(-1)*'Main Data Entry'!$G$21,0))","v":0},null,59.963999999999999,null,null,null,null,null,null,null,null,43658.032372685411,59.959602355957031,453.15838623046875,{"$f":"IF($AC204=\"\",$AE203,IF($AC204<>$AE203,$AC204,$AE203))","v":59.959602355957031},{"$f":"IF($AD204=\"\",$AF203,IF($AD204<>$AF203,$AD204,$AF203))","v":453.15838623046875}]
["T+84s",43658.032384259488,59.959602355957031,453.15838623046875,null,null,null,null,null,null,null,null,null,null,null,{"$f":"'Main Data Entry'!$G$21","v":0},{"$f":"IF($C205>(60+'Main Data Entry'!$D$23),(($C205-60-'Main Data Entry'!$D$23)/(60*'Main Data Entry'!$D$22-'Main Data Entry'!$D$23))*(-1)*'Main Data Entry'!$G$21,IF($C205<(60-'Main Data Entry'!$D$23),(($C205-60+'Main Data Entry'!$D$23)/(60*'Main Data Entry'!$D$22-'Main Data Entry'!$D$23))*(-1)*'Main Data Entry'!$G$21,0))","v":0},null,59.963999999999999,null,null,null,null,null,null,null,null,43658.032384259488,null,null,59.959602355957031,453.15838623046875]
["T+85s",43658.032395833565,59.959766387939453,452.43319702148438,null,null,null,null,null,null,null,null,null,null,null,{"$f":"'Main Data Entry'!$G$21","v":0},{"$f":"IF($C206>(60+'Main Data Entry'!$D$23),(($C206-60-'Main Data Entry'!$D$23)/(60*'Main Data Entry'!$D$22-'Main Data Entry'!$D$23))*(-1)*'Main Data Entry'!$G$21,IF($C206<(60-'Main Data Entry'!$D$23),(($C206-60+'Main Data Entry'!$D$23)/(60*'Main Data Entry'!$D$22-'Main Data Entry'!$D$23))*(-1)*'Main Data Entry'!$G$21,0))","v":0},null,59.963999999999999,null,null,null,null,null,null,null,null,43658.032395833565,59.959766387939453,452.43319702148438,59.959766387939453,452.43319702148438]
["T+86s",43658.032407407642,59.959766387939453,452.43319702148438,null,null,null,null,null,null,null,null,null,null,null,{"$f":"'Main Data Entry'!$G$21","v":0},{"$f":"IF($C207>(60+'Main Data Entry'!$D$23),(($C207-60-'Main Data Entry'!$D$23)/(60*'Main Data Entry'!$D$22-'Main Data Entry'!$D$23))*(-1)*'Main Data Entry'!$G$21,IF($C207<(60-'Main Data Entry'!$D$23),(($C207-60+'Main Data Entry'!$D$23)/(60*'Main Data Entry'!$D$22-'Main Data Entry'!$D$23))*(-1)*'Main Data Entry'!$G$21,0))","v":0},null,59.963999999999999,null,null,null,null,null,null,null,null,43658.032407407642,null,null,59.959766387939453,452.43319702148438]
["T+87s",43658.032418981718,59.959934234619141,452.6827392578125,null,null,null,null,null,null,null,null,null,null,null,{"$f":"'Main Data Entry'!$G$21","v":0},{"$f":"IF($C208>(60+'Main Data Entry'!$D$23),(($C208-60-'Main Data Entry'!$D$23)/(60*'Main Data Entry'!$D$22-'Main Data Entry'!$D$23))*(-1)*'Main Data Entry'!$G$21,IF($C208<(60-'Main Data Entry'!$D$23),(($C208-60+'Main Data Entry'!$D$23)/(60*'Main Data Entry'!$D$22-'Main Data Entry'!$D$23))*(-1)*'Main Data Entry'!$G$21,0))","v":0},null,59.963999999999999,null,null,null,null,null,null,null,null,43658.032418981718,59.959934234619141,452.6827392578125,59.959934234619141,452.6827392578125]
["T+88s",43658.032430555795,{"$f":"OFFSET($AE209,-$B$1,0)","v":59.959934234619141},{"$f":"OFFSET($AF209,-$B$1,0)","v":452.6827392578125},null,null,null,null,null,null,null,null,null,null,null,{"$f":"'Main Data Entry'!$G$21","v":0},{"$f":"IF($C209>(60+'Main Data Entry'!$D$23),(($C209-60-'Main Data Entry'!$D$23)/(60*'Main Data Entry'!$D$22-'Main Data Entry'!$D$23))*(-1)*'Main Data Entry'!$G$21,IF($C209<(60-'Main Data Entry'!$D$23),(($C209-60+'Main Data Entry'!$D$23)/(60*'Main Data Entry'!$D$22-'Main Data Entry'!$D$23))*(-1)*'Main Data Entry'!$G$21,0))","v":0},null,{"$f":"Grid_Nominal_Frequency-Expected_Deadband_Setting","v":59.963999999999999},null,null,null,null,null,null,null,null,43658.032430555795,null,null,59.959934234619141,452.6827392578125]
["T+89s",43658.032442129872,59.960098266601563,452.6827392578125,null,null,null,null,null,null,null,null,null,null,null,{"$f":"'Main Data Entry'!$G$21","v":0},{"$f":"IF($C210>(60+'Main Data Entry'!$D$23),(($C210-60-'Main Data Entry'!$D$23)/(60*'Main Data Entry'!$D$22-'Main Data Entry'!$D$23))*(-1)*'Main Data Entry'!$G$21,IF($C210<(60-'Main Data Entry'!$D$23),(($C210-60+'Main Data Entry'!$D$23)/(60*'Main Data Entry'!$D$22-'Main Data Entry'!$D$23))*(-1)*'Main Data Entry'!$G$21,0))","v":0},null,59.963999999999999,null,null,null,null,null,null,null,null,43658.032442129872,59.960098266601563,452.6827392578125,59.960098266601563,452.6827392578125]
["T+90s",43658.032453703949,59.960098266601563,452.6827392578125,null,null,null,null,null,null,null,null,null,null,null,{"$f":"'Main Data Entry'!$G$21","v":0},{"$f":"IF($C211>(60+'Main Data Entry'!$D$23),(($C211-60-'Main Data Entry'!$D$23)/(60*'Main Data Entry'!$D$22-'Main Data Entry'!$D$23))*(-1)*'Main Data Entry'!$G$21,IF($C211<(60-'Main Data Entry'!$D$23),(($C211-60+'Main Data Entry'!$D$23)/(60*'Main Data Entry'!$D$22-'Main Data Entry'!$D$23))*(-1)*'Main Data Entry'!$G$21,0))","v":0},null,59.963999999999999,null,null,null,null,null,null,null,null,43658.032453703949,null,null,59.960098266601563,452.6827392578125]
["T+91s",43658.032465278025,59.96026611328125,452.97824096679688,null,null,null,null,null,null,null,null,null,null,null,{"$f":"'Main Data Entry'!$G$21","v":0},{"$f":"IF($C212>(60+'Main Data Entry'!$D$23),(($C212-60-'Main Data Entry'!$D$23)/(60*'Main Data Entry'!$D$22-'Main Data Entry'!$D$23))*(-1)*'Main Data Entry'!$G$21,IF($C212<(60-'Main Data Entry'!$D$23),(($C212-60+'Main Data Entry'!$D$23)/(60*'Main Data Entry'!$D$22-'Main Data Entry'!$D$23))*(-1)*'Main Data Entry'!$G$21,0))","v":0},null,59.963999999999999,null,null,null,null,null,null,null,null,43658.032465278025,59.96026611328125,452.97824096679688,59.96026611328125,452.97824096679688]
["T+92s",43658.032476852102,59.96026611328125,452.97824096679688,null,null,null,null,null,null,null,null,null,null,null,{"$f":"'Main Data Entry'!$G$21","v":0},{"$f":"IF($C213>(60+'Main Data Entry'!$D$23),(($C213-60-'Main Data Entry'!$D$23)/(60*'Main Data Entry'!$D$22-'Main Data Entry'!$D$23))*(-1)*'Main Data Entry'!$G$21,IF($C213<(60-'Main Data Entry'!$D$23),(($C213-60+'Main Data Entry'!$D$23)/(60*'Main Data Entry'!$D$22-'Main Data Entry'!$D$23))*(-1)*'Main Data Entry'!$G$21,0))","v":0},null,59.963999999999999,null,null,null,null,null,null,null,null,43658.032476852102,null,null,59.96026611328125,452.97824096679688]
["T+93s",43658.032488426179,59.960430145263672,452.97885131835938,null,null,null,null,null,null,null,null,null,null,null,{"$f":"'Main Data Entry'!$G$21","v":0},{"$f":"IF($C214>(60+'Main Data Entry'!$D$23),(($C214-60-'Main Data Entry'!$D$23)/(60*'Main Data Entry'!$D$22-'Main Data Entry'!$D$23))*(-1)*'Main Data Entry'!$G$21,IF($C214<(60-'Main Data Entry'!$D$23),(($C214-60+'Main Data Entry'!$D$23)/(60*'Main Data Entry'!$D$22-'Main Data Entry'!$D$23))*(-1)*'Main Data Entry'!$G$21,0))","v":0},null,59.963999999999999,null,null,null,null,null,null,null,null,43658.032488426179,59.960430145263672,452.97885131835938,59.960430145263672,452.97885131835938]
["T+94s",43658.032500000256,59.960430145263672,452.97885131835938,null,null,null,null,null,null,null,null,null,null,null,{"$f":"'Main Data Entry'!$G$21","v":0},{"$f":"IF($C215>(60+'Main Data Entry'!$D$23),(($C215-60-'Main Data Entry'!$D$23)/(60*'Main Data Entry'!$D$22-'Main Data Entry'!$D$23))*(-1)*'Main Data Entry'!$G$21,IF($C215<(60-'Main Data Entry'!$D$23),(($C215-60+'Main Data Entry'!$D$23)/(60*'Main Data Entry'!$D$22-'Main Data Entry'!$D$23))*(-1)*'Main Data Entry'!$G$21,0))","v":0},null,59.963999999999999,null,null,null,null,null,null,null,null,43658.032500000256,null,null,59.960430145263672,452.97885131835938]
["T+95s",43658.032511574333,59.960594177246094,452.97885131835938,null,null,null,null,null,null,null,null,null,null,null,{"$f":"'Main Data Entry'!$G$21","v":0},{"$f":"IF($C216>(60+'Main Data Entry'!$D$23),(($C216-60-'Main Data Entry'!$D$23)/(60*'Main Data Entry'!$D$22-'Main Data Entry'!$D$23))*(-1)*'Main Data Entry'!$G$21,IF($C216<(60-'Main Data Entry'!$D$23),(($C216-60+'Main Data Entry'!$D$23)/(60*'Main Data Entry'!$D$22-'Main Data Entry'!$D$23))*(-1)*'Main Data Entry'!$G$21,0))","v":0},null,59.963999999999999,null,null,null,null,null,null,null,null,43658.032511574333,59.960594177246094,452.97885131835938,59.960594177246094,452.97885131835938]
["T+96s",43658.032523148409,59.960594177246094,452.97885131835938,null,null,null,null,null,null,null,null,null,null,null,{"$f":"'Main Data Entry'!$G$21","v":0},{"$f":"IF($C217>(60+'Main Data Entry'!$D$23),(($C217-60-'Main Data Entry'!$D$23)/(60*'Main Data Entry'!$D$22-'Main Data Entry'!$D$23))*(-1)*'Main Data Entry'!$G$21,IF($C217<(60-'Main Data Entry'!$D$23),(($C217-60+'Main Data Entry'!$D$23)/(60*'Main Data Entry'!$D$22-'Main Data Entry'!$D$23))*(-1)*'Main Data Entry'!$G$21,0))","v":0},null,59.963999999999999,null,null,null,null,null,null,null,null,43658.032523148409,null,null,59.960594177246094,452.97885131835938]
["T+97s",43658.032534722486,59.960762023925781,452.75128173828125,null,null,null,null,null,null,null,null,null,null,null,{"$f":"'Main Data Entry'!$G$21","v":0},{"$f":"IF($C218>(60+'Main Data Entry'!$D$23),(($C218-60-'Main Data Entry'!$D$23)/(60*'Main Data Entry'!$D$22-'Main Data Entry'!$D$23))*(-1)*'Main Data Entry'!$G$21,IF($C218<(60-'Main Data Entry'!$D$23),(($C218-60+'Main Data Entry'!$D$23)/(60*'Main Data Entry'!$D$22-'Main Data Entry'!$D$23))*(-1)*'Main Data Entry'!$G$21,0))","v":0},null,59.963999999999999,null,null,null,null,null,null,null,null,{"$f":"AB217+TIME(0,0,1)","v":43658.032534722486},59.960762023925781,452.75128173828125,59.960762023925781,452.75128173828125]
["T+98s",43658.032546296563,59.960762023925781,452.75128173828125,null,null,null,null,null,null,null,null,null,null,null,{"$f":"'Main Data Entry'!$G$21","v":0},{"$f":"IF($C219>(60+'Main Data Entry'!$D$23),(($C219-60-'Main Data Entry'!$D$23)/(60*'Main Data Entry'!$D$22-'Main Data Entry'!$D$23))*(-1)*'Main Data Entry'!$G$21,IF($C219<(60-'Main Data Entry'!$D$23),(($C219-60+'Main Data Entry'!$D$23)/(60*'Main Data Entry'!$D$22-'Main Data Entry'!$D$23))*(-1)*'Main Data Entry'!$G$21,0))","v":0},null,59.963999999999999,null,null,null,null,null,null,null,null,43658.032546296563,null,null,59.960762023925781,452.75128173828125]
["T+99s",43658.03255787064,59.958030700683594,452.952880859375,null,null,null,null,null,null,null,null,null,null,null,{"$f":"'Main Data Entry'!$G$21","v":0},{"$f":"IF($C220>(60+'Main Data Entry'!$D$23),(($C220-60-'Main Data Entry'!$D$23)/(60*'Main Data Entry'!$D$22-'Main Data Entry'!$D$23))*(-1)*'Main Data Entry'!$G$21,IF($C220<(60-'Main Data Entry'!$D$23),(($C220-60+'Main Data Entry'!$D$23)/(60*'Main Data Entry'!$D$22-'Main Data Entry'!$D$23))*(-1)*'Main Data Entry'!$G$21,0))","v":0},null,59.963999999999999,null,null,null,null,null,null,null,null,43658.03255787064,59.958030700683594,452.952880859375,59.958030700683594,452.952880859375]
["T+100s",43658.032569444717,59.958030700683594,452.952880859375,null,null,null,null,null,null,null,null,null,null,null,{"$f":"'Main Data Entry'!$G$21","v":0},{"$f":"IF($C221>(60+'Main Data Entry'!$D$23),(($C221-60-'Main Data Entry'!$D$23)/(60*'Main Data Entry'!$D$22-'Main Data Entry'!$D$23))*(-1)*'Main Data Entry'!$G$21,IF($C221<(60-'Main Data Entry'!$D$23),(($C221-60+'Main Data Entry'!$D$23)/(60*'Main Data Entry'!$D$22-'Main Data Entry'!$D$23))*(-1)*'Main Data Entry'!$G$21,0))","v":0},null,59.963999999999999,null,null,null,null,null,null,null,null,43658.032569444717,null,null,59.958030700683594,452.952880859375]
["T+101s",43658.032581018793,59.958015441894531,452.95388793945313,null,null,null,null,null,null,null,null,null,null,null,{"$f":"'Main Data Entry'!$G$21","v":0},{"$f":"IF($C222>(60+'Main Data Entry'!$D$23),(($C222-60-'Main Data Entry'!$D$23)/(60*'Main Data Entry'!$D$22-'Main Data Entry'!$D$23))*(-1)*'Main Data Entry'!$G$21,IF($C222<(60-'Main Data Entry'!$D$23),(($C222-60+'Main Data Entry'!$D$23)/(60*'Main Data Entry'!$D$22-'Main Data Entry'!$D$23))*(-1)*'Main Data Entry'!$G$21,0))","v":0},null,59.963999999999999,null,null,null,null,null,null,null,null,43658.032581018793,59.958015441894531,452.95388793945313,59.958015441894531,452.95388793945313]
["T+102s",43658.03259259287,59.958015441894531,452.95388793945313,null,null,null,null,null,null,null,null,null,null,null,{"$f":"'Main Data Entry'!$G$21","v":0},{"$f":"IF($C223>(60+'Main Data Entry'!$D$23),(($C223-60-'Main Data Entry'!$D$23)/(60*'Main Data Entry'!$D$22-'Main Data Entry'!$D$23))*(-1)*'Main Data Entry'!$G$21,IF($C223<(60-'Main Data Entry'!$D$23),(($C223-60+'Main Data Entry'!$D$23)/(60*'Main Data Entry'!$D$22-'Main Data Entry'!$D$23))*(-1)*'Main Data Entry'!$G$21,0))","v":0},null,59.963999999999999,null,null,null,null,null,null,null,null,43658.03259259287,null,null,59.958015441894531,452.95388793945313]
["T+103s",43658.032604166947,59.958011627197266,452.95504760742188,null,null,null,null,null,null,null,null,null,null,null,{"$f":"'Main Data Entry'!$G$21","v":0},{"$f":"IF($C224>(60+'Main Data Entry'!$D$23),(($C224-60-'Main Data Entry'!$D$23)/(60*'Main Data Entry'!$D$22-'Main Data Entry'!$D$23))*(-1)*'Main Data Entry'!$G$21,IF($C224<(60-'Main Data Entry'!$D$23),(($C224-60+'Main Data Entry'!$D$23)/(60*'Main Data Entry'!$D$22-'Main Data Entry'!$D$23))*(-1)*'Main Data Entry'!$G$21,0))","v":0},null,59.963999999999999,null,null,null,null,null,null,null,null,43658.032604166947,59.958011627197266,452.95504760742188,59.958011627197266,452.95504760742188]
["T+104s",43658.032615741024,59.958011627197266,452.95504760742188,null,null,null,null,null,null,null,null,null,null,null,{"$f":"'Main Data Entry'!$G$21","v":0},{"$f":"IF($C225>(60+'Main Data Entry'!$D$23),(($C225-60-'Main Data Entry'!$D$23)/(60*'Main Data Entry'!$D$22-'Main Data Entry'!$D$23))*(-1)*'Main Data Entry'!$G$21,IF($C225<(60-'Main Data Entry'!$D$23),(($C225-60+'Main Data Entry'!$D$23)/(60*'Main Data Entry'!$D$22-'Main Data Entry'!$D$23))*(-1)*'Main Data Entry'!$G$21,0))","v":0},null,59.963999999999999,null,null,null,null,null,null,null,null,43658.032615741024,null,null,59.958011627197266,452.95504760742188]
["T+105s",43658.0326273151,59.955051422119141,453.72665405273438,null,null,null,null,null,null,null,null,null,null,null,{"$f":"'Main Data Entry'!$G$21","v":0},{"$f":"IF($C226>(60+'Main Data Entry'!$D$23),(($C226-60-'Main Data Entry'!$D$23)/(60*'Main Data Entry'!$D$22-'Main Data Entry'!$D$23))*(-1)*'Main Data Entry'!$G$21,IF($C226<(60-'Main Data Entry'!$D$23),(($C226-60+'Main Data Entry'!$D$23)/(60*'Main Data Entry'!$D$22-'Main Data Entry'!$D$23))*(-1)*'Main Data Entry'!$G$21,0))","v":0},null,59.963999999999999,null,null,null,null,null,null,null,null,43658.0326273151,59.955051422119141,453.72665405273438,59.955051422119141,453.72665405273438]
["T+106s",43658.032638889177,59.955051422119141,453.72665405273438,null,null,null,null,null,null,null,null,null,null,null,{"$f":"'Main Data Entry'!$G$21","v":0},{"$f":"IF($C227>(60+'Main Data Entry'!$D$23),(($C227-60-'Main Data Entry'!$D$23)/(60*'Main Data Entry'!$D$22-'Main Data Entry'!$D$23))*(-1)*'Main Data Entry'!$G$21,IF($C227<(60-'Main Data Entry'!$D$23),(($C227-60+'Main Data Entry'!$D$23)/(60*'Main Data Entry'!$D$22-'Main Data Entry'!$D$23))*(-1)*'Main Data Entry'!$G$21,0))","v":0},null,59.963999999999999,null,null,null,null,null,null,null,null,43658.032638889177,null,null,59.955051422119141,453.72665405273438]
["T+107s",43658.032650463254,59.957447052001953,454.01141357421875,null,null,null,null,null,null,null,null,null,null,null,{"$f":"'Main Data Entry'!$G$21","v":0},{"$f":"IF($C228>(60+'Main Data Entry'!$D$23),(($C228-60-'Main Data Entry'!$D$23)/(60*'Main Data Entry'!$D$22-'Main Data Entry'!$D$23))*(-1)*'Main Data Entry'!$G$21,IF($C228<(60-'Main Data Entry'!$D$23),(($C228-60+'Main Data Entry'!$D$23)/(60*'Main Data Entry'!$D$22-'Main Data Entry'!$D$23))*(-1)*'Main Data Entry'!$G$21,0))","v":0},null,59.963999999999999,null,null,null,null,null,null,null,null,43658.032650463254,59.957447052001953,454.01141357421875,59.957447052001953,454.01141357421875]
["T+108s",43658.032662037331,59.957447052001953,454.01141357421875,null,null,null,null,null,null,null,null,null,null,null,{"$f":"'Main Data Entry'!$G$21","v":0},{"$f":"IF($C229>(60+'Main Data Entry'!$D$23),(($C229-60-'Main Data Entry'!$D$23)/(60*'Main Data Entry'!$D$22-'Main Data Entry'!$D$23))*(-1)*'Main Data Entry'!$G$21,IF($C229<(60-'Main Data Entry'!$D$23),(($C229-60+'Main Data Entry'!$D$23)/(60*'Main Data Entry'!$D$22-'Main Data Entry'!$D$23))*(-1)*'Main Data Entry'!$G$21,0))","v":0},null,59.963999999999999,null,null,null,null,null,null,null,null,43658.032662037331,null,null,59.957447052001953,454.01141357421875]
["T+109s",43658.032673611408,59.957817077636719,454.05169677734375,null,null,null,null,null,null,null,null,null,null,null,{"$f":"'Main Data Entry'!$G$21","v":0},{"$f":"IF($C230>(60+'Main Data Entry'!$D$23),(($C230-60-'Main Data Entry'!$D$23)/(60*'Main Data Entry'!$D$22-'Main Data Entry'!$D$23))*(-1)*'Main Data Entry'!$G$21,IF($C230<(60-'Main Data Entry'!$D$23),(($C230-60+'Main Data Entry'!$D$23)/(60*'Main Data Entry'!$D$22-'Main Data Entry'!$D$23))*(-1)*'Main Data Entry'!$G$21,0))","v":0},null,59.963999999999999,null,null,null,null,null,null,null,null,43658.032673611408,59.957817077636719,454.05169677734375,59.957817077636719,454.05169677734375]
["T+110s",43658.032685185484,59.957817077636719,454.05169677734375,null,null,null,null,null,null,null,null,null,null,null,{"$f":"'Main Data Entry'!$G$21","v":0},{"$f":"IF($C231>(60+'Main Data Entry'!$D$23),(($C231-60-'Main Data Entry'!$D$23)/(60*'Main Data Entry'!$D$22-'Main Data Entry'!$D$23))*(-1)*'Main Data Entry'!$G$21,IF($C231<(60-'Main Data Entry'!$D$23),(($C231-60+'Main Data Entry'!$D$23)/(60*'Main Data Entry'!$D$22-'Main Data Entry'!$D$23))*(-1)*'Main Data Entry'!$G$21,0))","v":0},null,59.963999999999999,null,null,null,null,null,null,null,null,43658.032685185484,null,null,59.957817077636719,454.05169677734375]
["T+111s",43658.032696759561,59.958179473876953,454.09124755859375,null,null,null,null,null,null,null,null,null,null,null,{"$f":"'Main Data Entry'!$G$21","v":0},{"$f":"IF($C232>(60+'Main Data Entry'!$D$23),(($C232-60-'Main Data Entry'!$D$23)/(60*'Main Data Entry'!$D$22-'Main Data Entry'!$D$23))*(-1)*'Main Data Entry'!$G$21,IF($C232<(60-'Main Data Entry'!$D$23),(($C232-60+'Main Data Entry'!$D$23)/(60*'Main Data Entry'!$D$22-'Main Data Entry'!$D$23))*(-1)*'Main Data Entry'!$G$21,0))","v":0},null,59.963999999999999,null,null,null,null,null,null,null,null,43658.032696759561,59.958179473876953,454.09124755859375,59.958179473876953,454.09124755859375]
["T+112s",43658.032708333638,59.958179473876953,454.09124755859375,null,null,null,null,null,null,null,null,null,null,null,{"$f":"'Main Data Entry'!$G$21","v":0},{"$f":"IF($C233>(60+'Main Data Entry'!$D$23),(($C233-60-'Main Data Entry'!$D$23)/(60*'Main Data Entry'!$D$22-'Main Data Entry'!$D$23))*(-1)*'Main Data Entry'!$G$21,IF($C233<(60-'Main Data Entry'!$D$23),(($C233-60+'Main Data Entry'!$D$23)/(60*'Main Data Entry'!$D$22-'Main Data Entry'!$D$23))*(-1)*'Main Data Entry'!$G$21,0))","v":0},null,59.963999999999999,null,null,null,null,null,null,null,null,43658.032708333638,null,null,59.958179473876953,454.09124755859375]
["T+113s",43658.032719907715,59.958545684814453,454.13079833984375,null,null,null,null,null,null,null,null,null,null,null,{"$f":"'Main Data Entry'!$G$21","v":0},{"$f":"IF($C234>(60+'Main Data Entry'!$D$23),(($C234-60-'Main Data Entry'!$D$23)/(60*'Main Data Entry'!$D$22-'Main Data Entry'!$D$23))*(-1)*'Main Data Entry'!$G$21,IF($C234<(60-'Main Data Entry'!$D$23),(($C234-60+'Main Data Entry'!$D$23)/(60*'Main Data Entry'!$D$22-'Main Data Entry'!$D$23))*(-1)*'Main Data Entry'!$G$21,0))","v":0},null,59.963999999999999,null,null,null,null,null,null,null,null,{"$f":"AB233+TIME(0,0,1)","v":43658.032719907715},59.958545684814453,454.13079833984375,59.958545684814453,454.13079833984375]
["T+114s",43658.032731481791,59.958545684814453,454.13079833984375,null,null,null,null,null,null,null,null,null,null,null,{"$f":"'Main Data Entry'!$G$21","v":0},{"$f":"IF($C235>(60+'Main Data Entry'!$D$23),(($C235-60-'Main Data Entry'!$D$23)/(60*'Main Data Entry'!$D$22-'Main Data Entry'!$D$23))*(-1)*'Main Data Entry'!$G$21,IF($C235<(60-'Main Data Entry'!$D$23),(($C235-60+'Main Data Entry'!$D$23)/(60*'Main Data Entry'!$D$22-'Main Data Entry'!$D$23))*(-1)*'Main Data Entry'!$G$21,0))","v":0},null,59.963999999999999,null,null,null,null,null,null,null,null,43658.032731481791,null,null,59.958545684814453,454.13079833984375]
["T+115s",43658.032743055868,59.957855224609375,454.74432373046875,null,null,null,null,null,null,null,null,null,null,null,{"$f":"'Main Data Entry'!$G$21","v":0},{"$f":"IF($C236>(60+'Main Data Entry'!$D$23),(($C236-60-'Main Data Entry'!$D$23)/(60*'Main Data Entry'!$D$22-'Main Data Entry'!$D$23))*(-1)*'Main Data Entry'!$G$21,IF($C236<(60-'Main Data Entry'!$D$23),(($C236-60+'Main Data Entry'!$D$23)/(60*'Main Data Entry'!$D$22-'Main Data Entry'!$D$23))*(-1)*'Main Data Entry'!$G$21,0))","v":0},null,59.963999999999999,null,null,null,null,null,null,null,null,43658.032743055868,59.957855224609375,454.74432373046875,59.957855224609375,454.74432373046875]
["T+116s",43658.032754629945,59.957855224609375,454.74432373046875,null,null,null,null,null,null,null,null,null,null,null,{"$f":"'Main Data Entry'!$G$21","v":0},{"$f":"IF($C237>(60+'Main Data Entry'!$D$23),(($C237-60-'Main Data Entry'!$D$23)/(60*'Main Data Entry'!$D$22-'Main Data Entry'!$D$23))*(-1)*'Main Data Entry'!$G$21,IF($C237<(60-'Main Data Entry'!$D$23),(($C237-60+'Main Data Entry'!$D$23)/(60*'Main Data Entry'!$D$22-'Main Data Entry'!$D$23))*(-1)*'Main Data Entry'!$G$21,0))","v":0},null,59.963999999999999,null,null,null,null,null,null,null,null,43658.032754629945,null,null,59.957855224609375,454.74432373046875]
["T+117s",43658.032766204022,59.957160949707031,454.75567626953125,null,null,null,null,null,null,null,null,null,null,null,{"$f":"'Main Data Entry'!$G$21","v":0},{"$f":"IF($C238>(60+'Main Data Entry'!$D$23),(($C238-60-'Main Data Entry'!$D$23)/(60*'Main Data Entry'!$D$22-'Main Data Entry'!$D$23))*(-1)*'Main Data Entry'!$G$21,IF($C238<(60-'Main Data Entry'!$D$23),(($C238-60+'Main Data Entry'!$D$23)/(60*'Main Data Entry'!$D$22-'Main Data Entry'!$D$23))*(-1)*'Main Data Entry'!$G$21,0))","v":0},null,59.963999999999999,null,null,null,null,null,null,null,null,43658.032766204022,59.957160949707031,454.75567626953125,59.957160949707031,454.75567626953125]
["T+118s",43658.032777778099,59.957160949707031,454.75567626953125,null,null,null,null,null,null,null,null,null,null,null,{"$f":"'Main Data Entry'!$G$21","v":0},{"$f":"IF($C239>(60+'Main Data Entry'!$D$23),(($C239-60-'Main Data Entry'!$D$23)/(60*'Main Data Entry'!$D$22-'Main Data Entry'!$D$23))*(-1)*'Main Data Entry'!$G$21,IF($C239<(60-'Main Data Entry'!$D$23),(($C239-60+'Main Data Entry'!$D$23)/(60*'Main Data Entry'!$D$22-'Main Data Entry'!$D$23))*(-1)*'Main Data Entry'!$G$21,0))","v":0},null,59.963999999999999,null,null,null,null,null,null,null,null,43658.032777778099,null,null,59.957160949707031,454.75567626953125]
["T+119s",43658.032789352175,59.958526611328125,454.76522827148438,null,null,null,null,null,null,null,null,null,null,null,{"$f":"'Main Data Entry'!$G$21","v":0},{"$f":"IF($C240>(60+'Main Data Entry'!$D$23),(($C240-60-'Main Data Entry'!$D$23)/(60*'Main Data Entry'!$D$22-'Main Data Entry'!$D$23))*(-1)*'Main Data Entry'!$G$21,IF($C240<(60-'Main Data Entry'!$D$23),(($C240-60+'Main Data Entry'!$D$23)/(60*'Main Data Entry'!$D$22-'Main Data Entry'!$D$23))*(-1)*'Main Data Entry'!$G$21,0))","v":0},null,59.963999999999999,null,null,null,null,null,null,null,null,43658.032789352175,59.958526611328125,454.76522827148438,59.958526611328125,454.76522827148438]
["T+120s",43658.032800926252,59.958526611328125,454.76522827148438,null,null,null,null,null,null,null,null,null,null,null,{"$f":"'Main Data Entry'!$G$21","v":0},{"$f":"IF($C241>(60+'Main Data Entry'!$D$23),(($C241-60-'Main Data Entry'!$D$23)/(60*'Main Data Entry'!$D$22-'Main Data Entry'!$D$23))*(-1)*'Main Data Entry'!$G$21,IF($C241<(60-'Main Data Entry'!$D$23),(($C241-60+'Main Data Entry'!$D$23)/(60*'Main Data Entry'!$D$22-'Main Data Entry'!$D$23))*(-1)*'Main Data Entry'!$G$21,0))","v":0},null,59.963999999999999,null,null,null,null,null,null,null,null,43658.032800926252,null,null,59.958526611328125,454.76522827148438]
[null,null,null,null,null,null,null,null,null,null,null,null,null,null,null,null,null,null,null,null,null,null,null,null,null,null,null,{"$f":"AB241+TIME(0,0,1)","v":43658.032812500329},59.959892272949219,454.77474975585938,59.959892272949219,454.77474975585938]
[null,null,null,null,null,null,null,null,null,null,null,null,null,null,null,null,null,null,null,null,null,null,null,null,null,null,null,43658.032824074406,null,null,59.959892272949219,454.77474975585938]
[null,null,null,null,null,null,null,null,null,null,null,null,null,null,null,null,null,null,null,null,null,null,null,null,null,null,null,43658.032835648482,59.961261749267578,453.9813232421875,59.961261749267578,453.9813232421875]
[null,null,null,null,null,null,null,null,null,null,null,null,null,null,null,null,null,null,null,null,null,null,null,null,null,null,null,43658.032847222559,null,null,59.961261749267578,453.9813232421875]
[null,null,null,null,null,null,null,null,null,null,null,null,null,null,null,null,null,null,null,null,null,null,null,null,null,null,null,43658.032858796636,59.962200164794922,453.97894287109375,59.962200164794922,453.97894287109375]
[null,null,null,null,null,null,null,null,null,null,null,null,null,null,null,null,null,null,null,null,null,null,null,null,null,null,null,43658.032870370713,null,null,59.962200164794922,453.97894287109375]
[null,null,null,null,null,null,null,null,null,null,null,null,null,null,null,null,null,null,null,null,null,null,null,null,null,null,null,43658.03288194479,59.963134765625,453.453369140625,59.963134765625,453.453369140625]
[null,null,null,null,null,null,null,null,null,null,null,null,null,null,null,null,null,null,null,null,null,null,null,null,null,null,null,43658.032893518866,null,null,59.963134765625,453.453369140625]
[null,null,null,null,null,null,null,null,null,null,null,null,null,null,null,null,null,null,null,null,null,null,null,null,null,null,null,43658.032905092943,59.964069366455078,453.45257568359375,59.964069366455078,453.45257568359375]
[null,null,null,null,null,null,null,null,null,null,null,null,null,null,null,null,null,null,null,null,null,null,null,null,null,null,null,43658.03291666702,null,null,59.964069366455078,453.45257568359375]
[null,null,null,null,null,null,null,null,null,null,null,null,null,null,null,null,null,null,null,null,null,null,null,null,null,null,null,43658.032928241097,59.965003967285156,453.23422241210938,59.965003967285156,453.23422241210938]
[null,null,null,null,null,null,null,null,null,null,null,null,null,null,null,null,null,null,null,null,null,null,null,null,null,null,null,43658.032939815173,null,null,59.965003967285156,453.23422241210938]
[null,null,null,null,null,null,null,null,null,null,null,null,null,null,null,null,null,null,null,null,null,null,null,null,null,null,null,43658.03295138925,59.965007781982422,453.23031616210938,59.965007781982422,453.23031616210938]
[null,null,null,null,null,null,null,null,null,null,null,null,null,null,null,null,null,null,null,null,null,null,null,null,null,null,null,43658.032962963327,null,null,59.965007781982422,453.23031616210938]
[null,null,null,null,null,null,null,null,null,null,null,null,null,null,null,null,null,null,null,null,null,null,null,null,null,null,null,43658.032974537404,59.965007781982422,453.22698974609375,59.965007781982422,453.22698974609375]
[null,null,null,null,null,null,null,null,null,null,null,null,null,null,null,null,null,null,null,null,null,null,null,null,null,null,null,43658.032986111481,null,null,59.965007781982422,453.22698974609375]
[null,null,null,null,null,null,null,null,null,null,null,null,null,null,null,null,null,null,null,null,null,null,null,null,null,null,null,43658.032997685557,59.970321655273438,453.2236328125,59.970321655273438,453.2236328125]
[null,null,null,null,null,null,null,null,null,null,null,null,null,null,null,null,null,null,null,null,null,null,null,null,null,null,null,43658.033009259634,null,null,59.970321655273438,453.2236328125]
[null,null,null,null,null,null,null,null,null,null,null,null,null,null,null,null,null,null,null,null,null,null,null,null,null,null,null,43658.033020833711,59.970325469970703,453.22027587890625,59.970325469970703,453.22027587890625]
[null,null,null,null,null,null,null,null,null,null,null,null,null,null,null,null,null,null,null,null,null,null,null,null,null,null,null,43658.033032407788,null,null,59.970325469970703,453.22027587890625]
[null,null,null,null,null,null,null,null,null,null,null,null,null,null,null,null,null,null,null,null,null,null,null,null,null,null,null,43658.033043981864,59.970325469970703,453.2169189453125,59.970325469970703,453.2169189453125]
[null,null,null,null,null,null,null,null,null,null,null,null,null,null,null,null,null,null,null,null,null,null,null,null,null,null,null,43658.033055555941,null,null,59.970325469970703,453.2169189453125]
[null,null,null,null,null,null,null,null,null,null,null,null,null,null,null,null,null,null,null,null,null,null,null,null,null,null,null,43658.033067130018,59.973014831542969,453.28842163085938,59.973014831542969,453.28842163085938]
[null,null,null,null,null,null,null,null,null,null,null,null,null,null,null,null,null,null,null,null,null,null,null,null,null,null,null,43658.033078704095,null,null,59.973014831542969,453.28842163085938]
[null,null,null,null,null,null,null,null,null,null,null,null,null,null,null,null,null,null,null,null,null,null,null,null,null,null,null,43658.033090278172,59.973033905029297,453.360107421875,59.973033905029297,453.360107421875]
[null,null,null,null,null,null,null,null,null,null,null,null,null,null,null,null,null,null,null,null,null,null,null,null,null,null,null,43658.033101852248,null,null,59.973033905029297,453.360107421875]
[null,null,null,null,null,null,null,null,null,null,null,null,null,null,null,null,null,null,null,null,null,null,null,null,null,null,null,43658.033113426325,59.970577239990234,453.29168701171875,59.970577239990234,453.29168701171875]
[null,null,null,null,null,null,null,null,null,null,null,null,null,null,null,null,null,null,null,null,null,null,null,null,null,null,null,43658.033125000402,null,null,59.970577239990234,453.29168701171875]
[null,null,null,null,null,null,null,null,null,null,null,null,null,null,null,null,null,null,null,null,null,null,null,null,null,null,null,43658.033136574479,59.970569610595703,453.22259521484375,59.970569610595703,453.22259521484375]
[null,null,null,null,null,null,null,null,null,null,null,null,null,null,null,null,null,null,null,null,null,null,null,null,null,null,null,43658.033148148555,null,null,59.970569610595703,453.22259521484375]
[null,null,null,null,null,null,null,null,null,null,null,null,null,null,null,null,null,null,null,null,null,null,null,null,null,null,null,43658.033159722632,59.967781066894531,453.28436279296875,59.967781066894531,453.28436279296875]
[null,null,null,null,null,null,null,null,null,null,null,null,null,null,null,null,null,null,null,null,null,null,null,null,null,null,null,43658.033171296709,null,null,{"$f":"IF($AC273=\"\",$AE272,IF($AC273<>$AE272,$AC273,$AE272))","v":59.967781066894531},{"$f":"IF($AD273=\"\",$AF272,IF($AD273<>$AF272,$AD273,$AF272))","v":453.28436279296875}]
[null,null,null,null,null,null,null,null,null,null,null,null,null,null,null,null,null,null,null,null,null,null,null,null,null,null,null,43658.033182870786,59.967781066894531,453.34686279296875,59.967781066894531,453.34686279296875]
[null,null,null,null,null,null,null,null,null,null,null,null,null,null,null,null,null,null,null,null,null,null,null,null,null,null,null,43658.033194444863,null,null,59.967781066894531,453.34686279296875]
[null,null,null,null,null,null,null,null,null,null,null,null,null,null,null,null,null,null,null,null,null,null,null,null,null,null,null,43658.033206018939,59.964756011962891,452.92739868164063,59.964756011962891,452.92739868164063]
[null,null,null,null,null,null,null,null,null,null,null,null,null,null,null,null,null,null,null,null,null,null,null,null,null,null,null,43658.033217593016,null,null,59.964756011962891,452.92739868164063]
[null,null,null,null,null,null,null,null,null,null,null,null,null,null,null,null,null,null,null,null,null,null,null,null,null,null,null,43658.033229167093,59.965000152587891,453.30838012695313,59.965000152587891,453.30838012695313]
[null,null,null,null,null,null,null,null,null,null,null,null,null,null,null,null,null,null,null,null,null,null,null,null,null,null,null,43658.03324074117,null,null,59.965000152587891,453.30838012695313]

{"sheet":"Chart","index":4,"n_rows":34,"n_cols":13,"rows_kept":34,"cut":false,"hidden":false,"merged":[[33,5,33,6],[0,12,0,16]]}
["Alignment Chart for Historian Data",null,null,null,null,null,null,null,null,null,null,null,{"$f":"CONCATENATE('Main Data Entry'!D7&\" \"&'Main Data Entry'!D9)","v":" "}]
["-Users may use this chart to align their frequency and MW data to the t(0) of the event provided by NERC staff.",null,null,null,null,null,null,null,null,null,null,null,{"$f":"'Main Data Entry'!D27","v":"2019-07-12T00:45:14"}]
["-Chart will not be available for manually entered data."]
[]
[]
[]
[]
[]
[]
[]
[]
[]
[]
[]
[]
[]
[]
[]
[]
[]
[]
[]
[]
[]
[]
[]
[]
[]
[]
[]
[]
[]
[]
[null,null,null,null,null,"OFFSET (s):",null,0]